program: Orca
programVersion: 5.0.2
elementType: O O O C C C C C C C C C C C C C C C C C C C C C C H H H H H H H H H H H H H H H H H H H H H H H H H H
charge: 0
multiplicity: 1
keywords: wb97x-d3
keywords: def2-TZVPP
keywords: def2/J RIJCOSX
keywords: DEFGRID2
keywords: scfconv7
keywords: smallprint printgap noloewdin
keywords: NOSOSCF
formula: C22H26O3
InChI: InChI=1/C22H26O3/c1-15(2)10-19-20(22(19,3)4)21(23)25-14-17-12-18(24-13-17)11-16-8-6-5-7-9-16/h5-10,12-13,19-20H,11,14H2,1-4H3
51 atoms
O  2.154164 1.454263 0.252297
O  2.138551 1.797813 -1.950727
O  -2.017852 2.495688 -0.690339
C  3.862496 -0.999682 -0.183129
C  2.475695 -1.496953 -0.44263
C  2.978527 -0.255238 -1.166877
C  4.239814 -0.42903 1.161706
C  4.995088 -1.766923 -0.825534
C  1.379176 -1.447027 0.559963
C  2.389058 1.088723 -1.001804
C  1.27464 -2.278448 1.599636
C  0.111843 -2.205958 2.541196
C  2.281477 -3.341202 1.915696
C  1.446917 2.686011 0.475555
C  -0.011743 2.505339 0.255036
C  -0.937524 1.842056 1.125095
C  -0.731193 2.872818 -0.830724
C  -2.138233 1.863434 0.501072
C  -3.468766 1.300784 0.844762
C  -3.81485 0.105265 -0.012186
C  -3.146531 -1.10242 0.175488
C  -4.781985 0.18839 -1.007367
C  -3.443133 -2.206034 -0.608865
C  -5.082335 -0.916295 -1.795823
C  -4.41427 -2.115749 -1.598963
H  2.422165 -2.356591 -1.107257
H  3.22922 -0.420206 -2.20848
H  4.705595 -1.212401 1.763409
H  4.972464 0.373548 1.05574
H  3.398872 -0.044904 1.731063
H  5.299892 -2.604422 -0.193784
H  4.714925 -2.172687 -1.798751
H  5.869262 -1.128754 -0.971462
H  0.582908 -0.726813 0.39877
H  0.450568 -2.08905 3.574079
H  -0.478694 -3.125799 2.512322
H  -0.551907 -1.372441 2.311568
H  3.099524 -3.387896 1.198612
H  1.805067 -4.325181 1.941392
H  2.713021 -3.186225 2.908049
H  1.852904 3.484176 -0.146546
H  1.654853 2.933711 1.5154
H  -0.727075 1.409621 2.091284
H  -0.473113 3.397763 -1.737385
H  -4.241736 2.067064 0.744645
H  -3.446354 1.012245 1.897235
H  -2.388401 -1.180692 0.946381
H  -5.309082 1.121826 -1.166493
H  -2.917342 -3.138457 -0.44643
H  -5.840005 -0.837357 -2.565236
H  -4.648671 -2.976857 -2.211583
elementType: O C H
totalener: -1079.74719663 hartree
nucrepener: 2194.98661376 hartree
electener: -3274.73381039 hartree
oneelecener: -5829.10035294 hartree
twoeener: 2554.36654255 hartree
cpcmener: -0.02663859 hartree
kineticenergy: 1074.86839099 hartree
xcener: -106.463543718125 hartree
chargesum: -0.0000000
charge: -0.267525 -0.474690 -0.277269 0.095436 -0.015679 -0.102816 -0.285236 -0.273706 -0.254955 0.399692 -0.008391 -0.245171 -0.266233 0.070344 -0.051787 -0.400823 -0.015794 0.241389 -0.076611 0.020524 -0.181295 -0.150538 -0.191704 -0.168974 -0.150374 0.112858 0.091773 0.093284 0.110491 0.096207 0.090485 0.087824 0.098340 0.114019 0.102980 0.101686 0.075588 0.090210 0.106439 0.100203 0.120817 0.112671 0.166861 0.171251 0.108163 0.118823 0.156163 0.138829 0.153402 0.155650 0.157165
qa: -0.2675 -0.4747 -0.2773 0.0954 -0.0157 -0.1028 -0.2852 -0.2737 -0.2550 0.3997 -0.0084 -0.2452 -0.2662 0.0703 -0.0518 -0.4008 -0.0158 0.2414 -0.0766 0.0205 -0.1813 -0.1505 -0.1917 -0.1690 -0.1504 0.1129 0.0918 0.0933 0.1105 0.0962 0.0905 0.0878 0.0983 0.1140 0.1030 0.1017 0.0756 0.0902 0.1064 0.1002 0.1208 0.1127 0.1669 0.1713 0.1082 0.1188 0.1562 0.1388 0.1534 0.1557 0.1572
va: 2.1109 2.0303 2.2831 3.6780 3.7999 3.8681 3.8820 3.9097 3.8644 4.1597 3.6444 3.9334 3.9380 3.8355 3.6114 3.9779 3.9756 3.5859 3.8154 3.6246 3.8915 3.9162 3.9446 3.9079 3.8868 1.0057 1.0274 0.9986 1.0033 1.0110 1.0036 1.0056 1.0013 0.9934 0.9981 0.9956 1.0031 1.0068 1.0003 0.9966 1.0099 0.9970 1.0041 1.0030 1.0100 1.0052 0.9866 1.0040 0.9938 0.9915 0.9901
dispcorr: -0.027069406 hartree
energy: -1079.774266038643
dipole: 14.96838 -14.82858 0.13981 -18.98668 18.08986 -0.89682 11.68242 -10.08832 1.59409
magnitude: 1.83438 au
magnitude: 4.66263 debye
