program: Orca
programVersion: 5.0.2
elementType: O O O C C C C C C C C C C C C C C C C C C C C C C H H H H H H H H H H H H H H H H H H H H H H H H H H
charge: 0
multiplicity: 1
keywords: wb97x-d3
keywords: def2-TZVPP
keywords: def2/J RIJCOSX
keywords: DEFGRID2
keywords: scfconv7
keywords: smallprint printgap noloewdin
keywords: NOSOSCF
formula: C22H26O3
InChI: InChI=1/C22H26O3/c1-15(2)10-19-20(22(19,3)4)21(23)25-14-17-12-18(24-13-17)11-16-8-6-5-7-9-16/h5-10,12-13,19-20H,11,14H2,1-4H3
51 atoms
O  2.308886 1.369019 0.231775
O  2.087592 1.578659 -1.978413
O  -1.882119 2.026472 1.425035
C  4.120039 -1.026507 -0.258307
C  2.733998 -1.569837 -0.220508
C  3.066245 -0.39251 -1.147982
C  4.703299 -0.309204 0.934201
C  5.157624 -1.832268 -1.006849
C  1.85143 -1.448397 0.963902
C  2.451008 0.940157 -1.013892
C  0.521834 -1.558558 0.909354
C  -0.322784 -1.492965 2.143225
C  -0.20557 -1.736428 -0.393631
C  1.596692 2.594707 0.466863
C  0.131077 2.356325 0.551531
C  -0.81007 2.135099 -0.508163
C  -0.585884 2.2741 1.697106
C  -2.014068 1.939021 0.079629
C  -3.363721 1.617697 -0.45826
C  -3.637791 0.131122 -0.473687
C  -3.592947 -0.580787 -1.668316
C  -3.912864 -0.557917 0.705677
C  -3.818958 -1.951128 -1.68815
C  -4.132072 -1.928331 0.690025
C  -4.08561 -2.630205 -0.507989
H  2.579502 -2.482732 -0.791909
H  3.147511 -0.662485 -2.194651
H  5.219564 -1.030996 1.570825
H  5.442299 0.428699 0.615592
H  3.972596 0.201737 1.553934
H  5.605558 -2.582954 -0.352273
H  4.729919 -2.354952 -1.863562
H  5.961329 -1.191746 -1.376091
H  2.324378 -1.303438 1.930367
H  -1.048862 -0.67801 2.082454
H  0.273083 -1.347126 3.044523
H  -0.905297 -2.41007 2.268479
H  -1.276239 -1.867053 -0.241334
H  0.15263 -2.608845 -0.945824
H  -0.07069 -0.873961 -1.051155
H  1.846456 3.335253 -0.293111
H  1.974033 2.956541 1.422293
H  -0.615355 2.126317 -1.568468
H  -0.316066 2.379888 2.736808
H  -3.430214 2.011832 -1.473129
H  -4.126436 2.134291 0.130532
H  -3.381425 -0.059292 -2.594633
H  -3.961535 -0.021131 1.645935
H  -3.784339 -2.488199 -2.627695
H  -4.343566 -2.448629 1.615801
H  -4.258805 -3.69872 -0.520889
elementType: O C H
totalener: -1079.74707994 hartree
nucrepener: 2257.49724898 hartree
electener: -3337.24432892 hartree
oneelecener: -5954.46750509 hartree
twoeener: 2617.22317617 hartree
cpcmener: -0.02503775 hartree
kineticenergy: 1074.85515701 hartree
xcener: -106.463533356899 hartree
chargesum: -0.0000000
charge: -0.258724 -0.484893 -0.276085 0.142882 -0.036897 -0.138856 -0.290902 -0.267515 -0.228925 0.417565 -0.022934 -0.246427 -0.239245 0.050782 -0.017305 -0.363202 -0.063491 0.243233 -0.057602 0.066346 -0.199998 -0.232015 -0.146652 -0.148637 -0.154475 0.111373 0.089672 0.097515 0.101129 0.090473 0.093387 0.086110 0.095772 0.122104 0.084394 0.099209 0.108726 0.040327 0.112951 0.094984 0.121528 0.108762 0.158829 0.172870 0.103596 0.116251 0.137826 0.140656 0.154082 0.155857 0.155585
qa: -0.2587 -0.4849 -0.2761 0.1429 -0.0369 -0.1389 -0.2909 -0.2675 -0.2289 0.4176 -0.0229 -0.2464 -0.2392 0.0508 -0.0173 -0.3632 -0.0635 0.2432 -0.0576 0.0663 -0.2000 -0.2320 -0.1467 -0.1486 -0.1545 0.1114 0.0897 0.0975 0.1011 0.0905 0.0934 0.0861 0.0958 0.1221 0.0844 0.0992 0.1087 0.0403 0.1130 0.0950 0.1215 0.1088 0.1588 0.1729 0.1036 0.1163 0.1378 0.1407 0.1541 0.1559 0.1556
va: 2.1100 2.0154 2.2654 3.7450 3.7942 3.8702 3.8978 3.9009 3.7909 4.1137 3.6836 3.9050 3.9538 3.8604 3.5670 3.9675 3.9334 3.5841 3.8031 3.5636 3.9150 3.9052 3.8686 3.8599 3.8590 1.0046 1.0317 0.9987 1.0009 1.0130 1.0023 1.0058 1.0021 1.0008 0.9948 1.0120 0.9961 1.0266 1.0065 1.0028 1.0075 1.0013 1.0220 0.9955 1.0121 1.0091 1.0051 1.0137 0.9921 0.9921 0.9910
dispcorr: -0.030595146 hartree
energy: -1079.777675088371
dipole: 10.86469 -10.89187 -0.02718 -13.89225 13.38739 -0.50486 2.90017 -2.02211 0.87806
magnitude: 1.01322 au
magnitude: 2.57540 debye
