program: Orca
programVersion: 5.0.2
elementType: O O O C C C C C C C C C C C C C C C C C C C C C C H H H H H H H H H H H H H H H H H H H H H H H H H H
charge: 0
multiplicity: 1
keywords: wb97x-d3
keywords: def2-TZVPP
keywords: def2/J RIJCOSX
keywords: DEFGRID2
keywords: scfconv7
keywords: smallprint printgap noloewdin
keywords: NOSOSCF
formula: C22H26O3
InChI: InChI=1/C22H26O3/c1-15(2)10-19-20(22(19,3)4)21(23)25-14-17-12-18(24-13-17)11-16-8-6-5-7-9-16/h5-10,12-13,19-20H,11,14H2,1-4H3
51 atoms
O  1.47577 0.560095 -0.073918
O  2.902363 0.461123 1.635133
O  -2.303325 1.257626 -1.596762
C  5.099571 0.014655 -0.517373
C  4.56918 -1.346202 -0.229201
C  3.598347 -0.210141 -0.563357
C  5.733239 0.845728 0.57099
C  5.742222 0.231297 -1.867803
C  4.633208 -1.969127 1.116549
C  2.671856 0.296972 0.460484
C  3.748364 -2.850276 1.589756
C  3.906804 -3.468868 2.944507
C  2.519708 -3.262865 0.838744
C  0.46883 1.060332 0.800191
C  -0.7684 1.270625 0.00558
C  -1.948825 1.926561 0.479389
C  -1.043627 0.887642 -1.261909
C  -2.846435 1.887234 -0.53324
C  -4.256356 2.340934 -0.641301
C  -5.22668 1.183541 -0.602416
C  -5.905617 0.777415 -1.745424
C  -5.438394 0.48856 0.586439
C  -6.785797 -0.297233 -1.702231
C  -6.315602 -0.583837 0.633072
C  -6.993282 -0.981084 -0.513661
H  4.651277 -2.051391 -1.052929
H  3.168543 -0.252828 -1.557342
H  6.809746 0.663846 0.585455
H  5.586644 1.909863 0.376376
H  5.353719 0.637322 1.566642
H  5.669006 1.276312 -2.175314
H  6.801592 -0.031117 -1.833268
H  5.277118 -0.377324 -2.644645
H  5.483286 -1.705388 1.739216
H  3.987177 -4.556866 2.873649
H  3.035176 -3.264931 3.572368
H  4.790042 -3.09917 3.465667
H  1.62576 -2.838777 1.305308
H  2.39224 -4.34768 0.862678
H  2.52619 -2.951016 -0.204133
H  0.790903 1.999716 1.258346
H  0.284392 0.350646 1.612188
H  -2.103557 2.366827 1.452328
H  -0.477097 0.37651 -2.023615
H  -4.400746 2.916603 -1.559089
H  -4.452616 3.020021 0.190498
H  -5.750201 1.307262 -2.677896
H  -4.912856 0.791059 1.485298
H  -7.30898 -0.599672 -2.600579
H  -6.472356 -1.110047 1.56623
H  -7.679395 -1.817666 -0.478068
elementType: O C H
totalener: -1079.75073236 hartree
nucrepener: 2041.68774673 hartree
electener: -3121.43847908 hartree
oneelecener: -5522.59004623 hartree
twoeener: 2401.15156714 hartree
cpcmener: -0.02637717 hartree
kineticenergy: 1074.86177904 hartree
xcener: -106.462804503304 hartree
chargesum: -0.0000000
charge: -0.286497 -0.467223 -0.279700 0.131502 -0.027147 -0.080778 -0.296900 -0.264221 -0.263912 0.378901 -0.019871 -0.225400 -0.267754 0.105111 -0.025117 -0.350526 -0.070470 0.203914 -0.068146 0.037982 -0.189075 -0.189800 -0.154169 -0.159698 -0.171286 0.111417 0.094458 0.097351 0.100076 0.096672 0.095694 0.093244 0.085978 0.119612 0.095251 0.093765 0.089257 0.100438 0.104832 0.094793 0.108033 0.109137 0.161211 0.172102 0.107832 0.117175 0.139172 0.142058 0.156535 0.156776 0.157411
qa: -0.2865 -0.4672 -0.2797 0.1315 -0.0271 -0.0808 -0.2969 -0.2642 -0.2639 0.3789 -0.0199 -0.2254 -0.2678 0.1051 -0.0251 -0.3505 -0.0705 0.2039 -0.0681 0.0380 -0.1891 -0.1898 -0.1542 -0.1597 -0.1713 0.1114 0.0945 0.0974 0.1001 0.0967 0.0957 0.0932 0.0860 0.1196 0.0953 0.0938 0.0893 0.1004 0.1048 0.0948 0.1080 0.1091 0.1612 0.1721 0.1078 0.1172 0.1392 0.1421 0.1565 0.1568 0.1574
va: 2.1225 2.0244 2.2686 3.7338 3.8327 3.8394 3.8945 3.9018 3.8528 4.0866 3.7155 3.9280 3.9445 3.8535 3.7117 4.0138 3.9563 3.6493 3.8254 3.6032 3.9543 3.9392 3.8949 3.9118 3.9008 1.0062 1.0249 0.9985 1.0008 1.0159 1.0022 1.0024 1.0048 1.0009 0.9967 0.9961 1.0070 0.9971 1.0004 1.0048 0.9947 0.9912 1.0066 1.0008 1.0106 1.0061 1.0046 1.0036 0.9910 0.9914 0.9906
dispcorr: -0.022532368 hartree
energy: -1079.773264724655
dipole: 23.18295 -23.43998 -0.25702 -10.92909 10.82965 -0.09944 4.59071 -5.09554 -0.50483
magnitude: 0.57515 au
magnitude: 1.46192 debye
