program: Orca
programVersion: 5.0.2
elementType: O O O C C C C C C C C C C C C C C C C C C C C C C H H H H H H H H H H H H H H H H H H H H H H H H H H
charge: 0
multiplicity: 1
keywords: wb97x-d3
keywords: def2-TZVPP
keywords: def2/J RIJCOSX
keywords: DEFGRID2
keywords: scfconv7
keywords: smallprint printgap noloewdin
keywords: NOSOSCF
formula: C22H26O3
InChI: InChI=1/C22H26O3/c1-15(2)10-19-20(22(19,3)4)21(23)25-14-17-12-18(24-13-17)11-16-8-6-5-7-9-16/h5-10,12-13,19-20H,11,14H2,1-4H3
51 atoms
O  2.181214 2.012085 0.032807
O  1.860237 0.278356 1.410869
O  -1.984194 3.329199 -0.789913
C  4.245387 -1.034861 -0.116667
C  3.013974 -1.42478 -0.854556
C  3.263511 0.050797 -0.520499
C  4.438248 -1.423506 1.32787
C  5.541413 -1.022728 -0.89256
C  1.922453 -2.205092 -0.223541
C  2.376454 0.747564 0.421293
C  0.645205 -2.18156 -0.611583
C  -0.386363 -3.032624 0.060583
C  0.139388 -1.313155 -1.722541
C  1.2745 2.833941 0.785626
C  -0.103891 2.74625 0.236213
C  -1.016183 1.637203 0.265207
C  -0.74927 3.736382 -0.419472
C  -2.138712 2.044684 -0.372733
C  -3.44133 1.404964 -0.703466
C  -3.60685 0.033148 -0.107867
C  -3.661377 -0.142571 1.273935
C  -3.751665 -1.081623 -0.927987
C  -3.858355 -1.402513 1.820107
C  -3.959476 -2.343546 -0.384505
C  -4.012855 -2.507702 0.991697
H  3.152051 -1.617171 -1.915178
H  3.576604 0.662184 -1.358234
H  3.516445 -1.511817 1.894707
H  4.94391 -2.389672 1.376513
H  5.074612 -0.697351 1.836339
H  6.004714 -2.010989 -0.874473
H  5.389068 -0.745829 -1.936309
H  6.250618 -0.315377 -0.459082
H  2.198772 -2.864859 0.593558
H  0.05142 -3.695782 0.806485
H  -0.929392 -3.645912 -0.662885
H  -1.133333 -2.409075 0.55886
H  0.82573 -0.509102 -1.984069
H  -0.821248 -0.865398 -1.460172
H  -0.036057 -1.905431 -2.624769
H  1.653561 3.84997 0.683575
H  1.307091 2.570772 1.842817
H  -0.852617 0.668748 0.709878
H  -0.468164 4.745658 -0.677487
H  -3.549339 1.345253 -1.790146
H  -4.252776 2.053004 -0.356135
H  -3.555663 0.714188 1.928928
H  -3.710853 -0.961023 -2.00399
H  -3.89964 -1.521133 2.895201
H  -4.075027 -3.197687 -1.039104
H  -4.173459 -3.489365 1.41809
elementType: O C H
totalener: -1079.73733733 hartree
nucrepener: 2216.79665154 hartree
electener: -3296.53398887 hartree
oneelecener: -5873.49083219 hartree
twoeener: 2576.95684332 hartree
cpcmener: -0.02952593 hartree
kineticenergy: 1074.85855948 hartree
xcener: -106.467015272171 hartree
chargesum: -0.0000000
charge: -0.296172 -0.499817 -0.289788 0.131526 -0.019384 -0.107906 -0.300398 -0.265013 -0.253976 0.420137 -0.009395 -0.229026 -0.268358 0.079950 -0.096226 -0.315673 -0.040470 0.224779 -0.018731 0.050097 -0.245812 -0.222432 -0.112271 -0.135806 -0.197970 0.115891 0.095114 0.092283 0.100726 0.102148 0.094366 0.087496 0.096265 0.124707 0.097605 0.101501 0.066903 0.102512 0.057815 0.121573 0.116760 0.116224 0.163487 0.177971 0.102976 0.115864 0.148149 0.143600 0.159490 0.158565 0.158144
qa: -0.2962 -0.4998 -0.2898 0.1315 -0.0194 -0.1079 -0.3004 -0.2650 -0.2540 0.4201 -0.0094 -0.2290 -0.2684 0.0799 -0.0962 -0.3157 -0.0405 0.2248 -0.0187 0.0501 -0.2458 -0.2224 -0.1123 -0.1358 -0.1980 0.1159 0.0951 0.0923 0.1007 0.1021 0.0944 0.0875 0.0963 0.1247 0.0976 0.1015 0.0669 0.1025 0.0578 0.1216 0.1168 0.1162 0.1635 0.1780 0.1030 0.1159 0.1481 0.1436 0.1595 0.1586 0.1581
va: 2.1072 1.9792 2.2665 3.7498 3.8192 3.8530 3.8955 3.8984 3.8278 4.0584 3.6475 3.9379 3.9329 3.8520 3.7368 3.9509 3.9766 3.6626 3.8195 3.5317 3.9423 3.8840 3.8262 3.8086 3.8798 1.0033 1.0312 1.0161 0.9982 1.0000 1.0021 1.0047 1.0021 0.9996 1.0140 0.9925 0.9985 1.0074 1.0164 1.0000 0.9977 1.0114 1.0087 0.9941 1.0113 1.0027 1.0001 1.0047 0.9890 0.9916 0.9917
dispcorr: -0.028538230 hartree
energy: -1079.765875557270
dipole: 11.77800 -11.64821 0.12978 -16.66298 16.85661 0.19363 -2.40728 1.51316 -0.89412
magnitude: 0.92400 au
magnitude: 2.34863 debye
