program: Orca
programVersion: 5.0.2
elementType: O O O C C C C C C C C C C C C C C C C C C C C C C H H H H H H H H H H H H H H H H H H H H H H H H H H
charge: 0
multiplicity: 1
keywords: wb97x-d3
keywords: def2-TZVPP
keywords: def2/J RIJCOSX
keywords: DEFGRID2
keywords: scfconv7
keywords: smallprint printgap noloewdin
keywords: NOSOSCF
formula: C22H26O3
InChI: InChI=1/C22H26O3/c1-15(2)10-19-20(22(19,3)4)21(23)25-14-17-12-18(24-13-17)11-16-8-6-5-7-9-16/h5-10,12-13,19-20H,11,14H2,1-4H3
51 atoms
O  2.401524 2.111196 -0.14108
O  1.503344 0.842089 1.463539
O  -1.676483 1.865095 -1.331608
C  3.517448 -1.363206 0.69712
C  2.729645 -1.289971 -0.570574
C  3.276366 -0.009226 0.080864
C  2.872873 -1.795933 1.992137
C  4.943502 -1.851462 0.574355
C  1.275998 -1.574818 -0.64879
C  2.308644 0.986045 0.572626
C  0.52678 -1.313699 -1.725212
C  -0.905755 -1.739461 -1.809882
C  1.060599 -0.623783 -2.94404
C  1.439393 3.149645 0.104683
C  0.054825 2.713089 -0.230049
C  -1.03782 2.541698 0.675847
C  -0.397528 2.294867 -1.435178
C  -2.059529 2.016927 -0.037241
C  -3.381434 1.47837 0.365148
C  -3.341542 -0.019723 0.583768
C  -2.417265 -0.578971 1.465303
C  -4.230655 -0.861857 -0.074019
C  -2.395807 -1.945966 1.696211
C  -4.209811 -2.233792 0.152809
C  -3.295648 -2.779292 1.042117
H  3.281368 -1.548936 -1.469342
H  4.118051 0.42886 -0.443565
H  1.807529 -1.59519 2.056163
H  3.008015 -2.872341 2.113274
H  3.353298 -1.310536 2.843057
H  4.980808 -2.94177 0.609568
H  5.403102 -1.532865 -0.362089
H  5.557535 -1.470974 1.392848
H  0.811055 -2.07853 0.193283
H  -1.058508 -2.397753 -2.669596
H  -1.564785 -0.882048 -1.96215
H  -1.233683 -2.271055 -0.91747
H  1.287984 -1.347253 -3.731259
H  1.965088 -0.050315 -2.74954
H  0.317067 0.05747 -3.359878
H  1.769581 3.970943 -0.528888
H  1.497341 3.485437 1.141294
H  -1.043781 2.759647 1.732297
H  0.055674 2.245327 -2.412777
H  -4.144438 1.725493 -0.375868
H  -3.674325 1.973335 1.293476
H  -1.705493 0.058747 1.976677
H  -4.949838 -0.442821 -0.767782
H  -1.673349 -2.362352 2.38662
H  -4.910732 -2.87448 -0.366652
H  -3.278688 -3.84643 1.221388
elementType: O C H
totalener: -1079.73402045 hartree
nucrepener: 2282.81680053 hartree
electener: -3362.55082098 hartree
oneelecener: -6006.25807432 hartree
twoeener: 2643.70725334 hartree
cpcmener: -0.03173321 hartree
kineticenergy: 1074.87492681 hartree
xcener: -106.469282303407 hartree
chargesum: -0.0000000
charge: -0.284243 -0.488091 -0.281244 0.151867 -0.031669 -0.117594 -0.289047 -0.268766 -0.249408 0.395653 -0.033481 -0.238740 -0.302546 0.082748 -0.025469 -0.336416 -0.078459 0.211477 -0.035594 0.011933 -0.189025 -0.194456 -0.171384 -0.150131 -0.161423 0.113210 0.096811 0.081003 0.096961 0.103533 0.094828 0.087933 0.096104 0.133759 0.114302 0.087569 0.085261 0.121315 0.098238 0.093986 0.124467 0.122565 0.165109 0.178177 0.102905 0.112925 0.146186 0.141552 0.157799 0.158594 0.158416
qa: -0.2842 -0.4881 -0.2812 0.1519 -0.0317 -0.1176 -0.2890 -0.2688 -0.2494 0.3957 -0.0335 -0.2387 -0.3025 0.0827 -0.0255 -0.3364 -0.0785 0.2115 -0.0356 0.0119 -0.1890 -0.1945 -0.1714 -0.1501 -0.1614 0.1132 0.0968 0.0810 0.0970 0.1035 0.0948 0.0879 0.0961 0.1338 0.1143 0.0876 0.0853 0.1213 0.0982 0.0940 0.1245 0.1226 0.1651 0.1782 0.1029 0.1129 0.1462 0.1416 0.1578 0.1586 0.1584
va: 2.1096 1.9983 2.2462 3.7658 3.7991 3.8383 3.8965 3.8972 3.7999 4.1403 3.6863 3.9230 3.9498 3.8331 3.5488 3.9922 3.9249 3.6018 3.8298 3.6213 3.8461 3.9146 3.8665 3.8673 3.8554 1.0014 1.0313 1.0161 1.0002 1.0003 1.0024 1.0039 1.0022 0.9916 0.9987 1.0049 1.0075 0.9968 1.0028 0.9980 0.9946 1.0013 1.0053 0.9906 1.0162 1.0039 1.0068 1.0034 0.9927 0.9903 0.9907
dispcorr: -0.030498065 hartree
energy: -1079.764518514547
dipole: 9.27175 -8.82401 0.44774 -14.41679 14.59823 0.18145 -3.17944 2.38828 -0.79116
magnitude: 0.92700 au
magnitude: 2.35625 debye
