program: Orca
programVersion: 5.0.2
elementType: O O O C C C C C C C C C C C C C C C C C C C C C C H H H H H H H H H H H H H H H H H H H H H H H H H H
charge: 0
multiplicity: 1
keywords: wb97x-d3
keywords: def2-TZVPP
keywords: def2/J RIJCOSX
keywords: DEFGRID2
keywords: scfconv7
keywords: smallprint printgap noloewdin
keywords: NOSOSCF
formula: C22H26O3
InChI: InChI=1/C22H26O3/c1-15(2)10-19-20(22(19,3)4)21(23)25-14-17-12-18(24-13-17)11-16-8-6-5-7-9-16/h5-10,12-13,19-20H,11,14H2,1-4H3
51 atoms
O  1.632358 1.30745 -1.500605
O  2.762611 1.549388 0.412077
O  -1.376967 1.784191 1.633746
C  4.300461 -1.028537 -0.363202
C  3.034316 -1.496103 0.261278
C  2.993961 -0.457668 -0.876321
C  5.288621 -0.18778 0.407359
C  4.974224 -1.979982 -1.325833
C  2.627481 -1.137427 1.639276
C  2.493507 0.888125 -0.565414
C  1.359849 -1.178576 2.057686
C  0.976817 -0.806919 3.455268
C  0.239058 -1.570893 1.135841
C  0.8414 2.471412 -1.19932
C  -0.241278 2.115289 -0.243985
C  -1.419479 1.352697 -0.537618
C  -0.270305 2.340455 1.089372
C  -2.069756 1.176137 0.635605
C  -3.30825 0.44673 1.020733
C  -3.911541 -0.256335 -0.163498
C  -3.408659 -1.484986 -0.585535
C  -4.953449 0.323896 -0.879047
C  -3.938819 -2.121775 -1.69841
C  -5.488248 -0.311743 -1.99242
C  -4.981448 -1.535965 -2.405658
H  2.676399 -2.465619 -0.077116
H  2.663108 -0.842088 -1.833771
H  5.843084 0.464934 -0.269084
H  4.84416 0.435287 1.177653
H  6.01377 -0.842594 0.894671
H  5.580425 -1.436846 -2.053152
H  5.634459 -2.662839 -0.787757
H  4.250971 -2.582524 -1.876742
H  3.402126 -0.836185 2.33739
H  1.839862 -0.529759 4.060313
H  0.459008 -1.629233 3.955652
H  0.280455 0.03617 3.450198
H  0.166638 -0.897734 0.278593
H  -0.724544 -1.557609 1.645304
H  0.380055 -2.575578 0.730335
H  0.430996 2.779962 -2.159063
H  1.464444 3.283254 -0.823685
H  -1.723017 0.980518 -1.503492
H  0.391119 2.863322 1.76223
H  -4.032888 1.141555 1.454833
H  -3.067678 -0.27881 1.804028
H  -2.595825 -1.947327 -0.03663
H  -5.353192 1.279585 -0.561361
H  -3.539005 -3.077194 -2.012909
H  -6.301704 0.150524 -2.536496
H  -5.396335 -2.03227 -3.273271
elementType: O C H
totalener: -1079.73628439 hartree
nucrepener: 2211.16985516 hartree
electener: -3290.90613955 hartree
oneelecener: -5861.89234108 hartree
twoeener: 2570.98620153 hartree
cpcmener: -0.02965081 hartree
kineticenergy: 1074.85950125 hartree
xcener: -106.465268553073 hartree
chargesum: -0.0000000
charge: -0.300372 -0.492215 -0.289391 0.132775 -0.021508 -0.087490 -0.294639 -0.267168 -0.269656 0.388826 -0.009768 -0.218980 -0.298494 0.090592 -0.053056 -0.330135 -0.041044 0.186173 -0.016834 0.010891 -0.201608 -0.185476 -0.172395 -0.161956 -0.165286 0.114497 0.091264 0.102543 0.090183 0.098779 0.096152 0.095171 0.087647 0.126114 0.088544 0.101760 0.089324 0.086882 0.101394 0.119905 0.121963 0.117633 0.155054 0.172825 0.109688 0.115327 0.164923 0.140801 0.158874 0.160181 0.160787
qa: -0.3004 -0.4922 -0.2894 0.1328 -0.0215 -0.0875 -0.2946 -0.2672 -0.2697 0.3888 -0.0098 -0.2190 -0.2985 0.0906 -0.0531 -0.3301 -0.0410 0.1862 -0.0168 0.0109 -0.2016 -0.1855 -0.1724 -0.1620 -0.1653 0.1145 0.0913 0.1025 0.0902 0.0988 0.0962 0.0952 0.0876 0.1261 0.0885 0.1018 0.0893 0.0869 0.1014 0.1199 0.1220 0.1176 0.1551 0.1728 0.1097 0.1153 0.1649 0.1408 0.1589 0.1602 0.1608
va: 2.0972 1.9887 2.2422 3.7699 3.8015 3.8348 3.8863 3.8974 3.8029 4.1124 3.6816 3.9072 3.9624 3.8348 3.6121 3.9398 3.9270 3.6067 3.8170 3.6026 3.9039 3.9367 3.9294 3.8914 3.8874 1.0044 1.0326 0.9997 1.0183 0.9990 1.0023 1.0022 1.0044 0.9987 1.0085 0.9949 1.0011 0.9942 1.0025 1.0007 0.9923 1.0110 1.0070 1.0025 1.0102 1.0010 0.9887 1.0043 0.9924 0.9898 0.9892
dispcorr: -0.028305142 hartree
energy: -1079.764589533444
dipole: 12.53242 -13.20376 -0.67134 -12.50109 11.67830 -0.82279 3.60390 -4.37167 -0.76777
magnitude: 1.31040 au
magnitude: 3.33078 debye
