program: Orca
programVersion: 5.0.2
elementType: O O O C C C C C C C C C C C C C C C C C C C C C C H H H H H H H H H H H H H H H H H H H H H H H H H H
charge: 0
multiplicity: 1
keywords: wb97x-d3
keywords: def2-TZVPP
keywords: def2/J RIJCOSX
keywords: DEFGRID2
keywords: scfconv7
keywords: smallprint printgap noloewdin
keywords: NOSOSCF
formula: C22H26O3
InChI: InChI=1/C22H26O3/c1-15(2)10-19-20(22(19,3)4)21(23)25-14-17-12-18(24-13-17)11-16-8-6-5-7-9-16/h5-10,12-13,19-20H,11,14H2,1-4H3
51 atoms
O  2.322959 1.362848 0.265325
O  2.193768 1.609512 -1.949567
O  -1.91259 2.038166 1.3800
C  4.166973 -1.019458 -0.178075
C  2.785162 -1.567535 -0.243841
C  3.16863 -0.361443 -1.113957
C  4.672414 -0.342257 1.071974
C  5.252672 -1.795754 -0.888592
C  1.827224 -1.475434 0.883777
C  2.526664 0.956696 -0.979726
C  0.503024 -1.554741 0.732379
C  -0.425457 -1.521835 1.90532
C  -0.13082 -1.672714 -0.625388
C  1.587302 2.578245 0.491384
C  0.123209 2.32299 0.541246
C  -0.794839 2.069664 -0.532056
C  -0.618637 2.285169 1.672698
C  -2.014377 1.904086 0.032481
C  -3.358421 1.59042 -0.523277
C  -3.678078 0.114704 -0.460108
C  -3.667993 -0.657237 -1.617921
C  -3.955753 -0.506223 0.75592
C  -3.918431 -2.022719 -1.564671
C  -4.198821 -1.871646 0.813382
C  -4.177118 -2.63582 -0.346828
H  2.667029 -2.462653 -0.850705
H  3.317064 -0.600168 -2.160703
H  5.150279 -1.086243 1.712612
H  5.426659 0.406248 0.824581
H  3.903117 0.144161 1.664056
H  4.877496 -2.297818 -1.781007
H  6.069015 -1.138095 -1.193485
H  5.670349 -2.559122 -0.229181
H  2.236053 -1.377108 1.884866
H  0.109615 -1.453502 2.852326
H  -1.052398 -2.417279 1.932532
H  -1.111849 -0.673799 1.841384
H  0.157366 -0.849376 -1.283151
H  -1.218551 -1.674798 -0.563187
H  0.167602 -2.594497 -1.131151
H  1.846779 3.32716 -0.256539
H  1.934638 2.938772 1.457866
H  -0.57782 2.022662 -1.587243
H  -0.367647 2.428683 2.712435
H  -3.385063 1.92543 -1.560261
H  -4.118431 2.163583 0.013745
H  -3.458516 -0.186087 -2.571059
H  -3.982174 0.078345 1.667904
H  -3.905934 -2.607392 -2.475541
H  -4.408441 -2.339568 1.766828
H  -4.366897 -3.700386 -0.30119
elementType: O C H
totalener: -1079.73463723 hartree
nucrepener: 2256.14775708 hartree
electener: -3335.88239431 hartree
oneelecener: -5951.90106273 hartree
twoeener: 2616.01866842 hartree
cpcmener: -0.03007810 hartree
kineticenergy: 1074.84916601 hartree
xcener: -106.464394176729 hartree
chargesum: -0.0000000
charge: -0.263927 -0.516672 -0.283552 0.141413 -0.031587 -0.145440 -0.290898 -0.269087 -0.242433 0.441862 -0.020929 -0.245204 -0.233968 0.053680 -0.029258 -0.352509 -0.052339 0.230572 -0.048398 0.062278 -0.205322 -0.229392 -0.140328 -0.163817 -0.159583 0.114413 0.092112 0.098957 0.102757 0.089819 0.088529 0.096557 0.094065 0.127550 0.102791 0.108594 0.080015 0.096928 0.028446 0.118661 0.123227 0.112418 0.159796 0.176335 0.103296 0.117131 0.140416 0.142886 0.158205 0.160499 0.160432
qa: -0.2639 -0.5167 -0.2836 0.1414 -0.0316 -0.1454 -0.2909 -0.2691 -0.2424 0.4419 -0.0209 -0.2452 -0.2340 0.0537 -0.0293 -0.3525 -0.0523 0.2306 -0.0484 0.0623 -0.2053 -0.2294 -0.1403 -0.1638 -0.1596 0.1144 0.0921 0.0990 0.1028 0.0898 0.0885 0.0966 0.0941 0.1275 0.1028 0.1086 0.0800 0.0969 0.0284 0.1187 0.1232 0.1124 0.1598 0.1763 0.1033 0.1171 0.1404 0.1429 0.1582 0.1605 0.1604
va: 2.1121 1.9738 2.2563 3.7481 3.7894 3.8738 3.8956 3.9003 3.7911 4.0761 3.6590 3.9061 3.9505 3.8477 3.5681 3.9572 3.9277 3.5975 3.7987 3.5581 3.9006 3.8843 3.8522 3.8592 3.8604 1.0034 1.0315 0.9985 1.0008 1.0127 1.0052 1.0019 1.0023 1.0000 1.0125 0.9964 0.9918 1.0037 1.0318 1.0044 1.0076 1.0017 1.0205 0.9940 1.0122 1.0084 1.0045 1.0148 0.9906 0.9905 0.9888
dispcorr: -0.030777320 hartree
energy: -1079.765414546826
dipole: 10.80217 -10.82901 -0.02684 -13.83915 13.27279 -0.56636 2.56322 -1.63362 0.92959
magnitude: 1.08887 au
magnitude: 2.76768 debye
