program: Orca
programVersion: 5.0.2
elementType: O O O C C C C C C C C C C C C C C C C C C C C C C H H H H H H H H H H H H H H H H H H H H H H H H H H
charge: 0
multiplicity: 1
keywords: wb97x-d3
keywords: def2-TZVPP
keywords: def2/J RIJCOSX
keywords: DEFGRID2
keywords: scfconv7
keywords: smallprint printgap noloewdin
keywords: NOSOSCF
formula: C22H26O3
InChI: InChI=1/C22H26O3/c1-15(2)10-19-20(22(19,3)4)21(23)25-14-17-12-18(24-13-17)11-16-8-6-5-7-9-16/h5-10,12-13,19-20H,11,14H2,1-4H3
51 atoms
O  2.186012 2.068255 -0.436841
O  2.32551 0.848442 1.430518
O  -1.85319 0.701633 -1.334428
C  4.964759 -0.312901 0.2859
C  3.892399 -1.046649 -0.44262
C  3.866024 0.490116 -0.374858
C  5.093601 -0.409904 1.786004
C  6.305909 -0.204587 -0.403496
C  2.871263 -1.873045 0.245371
C  2.745328 1.128715 0.330094
C  1.673846 -2.16536 -0.270198
C  0.710379 -3.05959 0.445652
C  1.212592 -1.643466 -1.598926
C  0.942043 2.649255 -0.00595
C  -0.202864 1.732645 -0.262651
C  -0.760336 0.724157 0.591986
C  -0.908828 1.663704 -1.415725
C  -1.75577 0.130112 -0.105897
C  -2.713975 -0.958946 0.215534
C  -4.137354 -0.462034 0.280287
C  -4.939526 -0.446597 -0.857145
C  -4.658344 0.022551 1.476706
C  -6.237642 0.043148 -0.799631
C  -5.955734 0.51149 1.537717
C  -6.749434 0.523703 0.398141
H  4.158144 -1.396002 -1.436768
H  4.142966 0.987011 -1.297086
H  5.548475 0.496559 2.188755
H  4.154089 -0.568085 2.306631
H  5.751835 -1.24353 2.037352
H  6.92441 -1.074269 -0.174493
H  6.203827 -0.146389 -1.487803
H  6.845336 0.683917 -0.070865
H  3.134992 -2.290565 1.212462
H  1.127607 -3.462425 1.368121
H  0.41027 -3.899368 -0.186178
H  -0.207078 -2.519811 0.695824
H  1.479335 -2.337716 -2.40148
H  1.649822 -0.677076 -1.849586
H  0.126115 -1.540916 -1.625859
H  0.845719 3.553698 -0.603594
H  0.995766 2.945142 1.041855
H  -0.465784 0.481815 1.600178
H  -0.855393 2.218539 -2.33976
H  -2.41959 -1.386938 1.174487
H  -2.630685 -1.757484 -0.527182
H  -4.54993 -0.827558 -1.793731
H  -4.044046 0.012289 2.369326
H  -6.850117 0.048138 -1.692003
H  -6.349519 0.877726 2.477036
H  -7.762057 0.902435 0.444092
elementType: O C H
totalener: -1079.73716244 hartree
nucrepener: 2172.64116404 hartree
electener: -3252.37832648 hartree
oneelecener: -5785.09138362 hartree
twoeener: 2532.71305714 hartree
cpcmener: -0.03128529 hartree
kineticenergy: 1074.86138419 hartree
xcener: -106.463817678902 hartree
chargesum: 0.0000000
charge: -0.293328 -0.495170 -0.290410 0.139418 -0.018993 -0.104238 -0.299979 -0.265716 -0.281426 0.406986 -0.000644 -0.218190 -0.305390 0.068709 -0.067440 -0.313332 -0.035637 0.192218 -0.038352 0.057311 -0.204679 -0.207334 -0.167391 -0.161226 -0.170482 0.115124 0.095557 0.102244 0.091148 0.099039 0.094570 0.087654 0.096616 0.126196 0.092897 0.103164 0.081778 0.125710 0.092572 0.096334 0.122024 0.119433 0.155771 0.175254 0.114589 0.121197 0.141656 0.144293 0.159292 0.159449 0.161155
qa: -0.2933 -0.4952 -0.2904 0.1394 -0.0190 -0.1042 -0.3000 -0.2657 -0.2814 0.4070 -0.0006 -0.2182 -0.3054 0.0687 -0.0674 -0.3133 -0.0356 0.1922 -0.0384 0.0573 -0.2047 -0.2073 -0.1674 -0.1612 -0.1705 0.1151 0.0956 0.1022 0.0911 0.0990 0.0946 0.0877 0.0966 0.1262 0.0929 0.1032 0.0818 0.1257 0.0926 0.0963 0.1220 0.1194 0.1558 0.1753 0.1146 0.1212 0.1417 0.1443 0.1593 0.1594 0.1612
va: 2.0991 1.9881 2.2513 3.7539 3.7957 3.8347 3.8888 3.8967 3.8299 4.0948 3.6541 3.9230 3.9504 3.8554 3.5979 3.9515 3.9508 3.5671 3.7654 3.5762 3.9526 3.9389 3.9009 3.8954 3.8879 1.0031 1.0329 0.9999 1.0177 0.9987 1.0023 1.0042 1.0022 1.0010 1.0101 0.9942 0.9963 0.9978 1.0081 1.0009 0.9965 1.0065 1.0214 0.9945 1.0063 1.0002 1.0087 1.0032 0.9906 0.9906 0.9894
dispcorr: -0.027283014 hartree
energy: -1079.764445454085
dipole: 16.10776 -15.93806 0.16971 -11.87254 11.74862 -0.12392 0.70982 -1.60754 -0.89772
magnitude: 0.92199 au
magnitude: 2.34350 debye
