program: Orca
programVersion: 5.0.2
elementType: O O O C C C C C C C C C C C C C C C C C C C C C C H H H H H H H H H H H H H H H H H H H H H H H H H H
charge: 0
multiplicity: 1
keywords: wb97x-d3
keywords: def2-TZVPP
keywords: def2/J RIJCOSX
keywords: DEFGRID2
keywords: scfconv7
keywords: smallprint printgap noloewdin
keywords: NOSOSCF
formula: C22H26O3
InChI: InChI=1/C22H26O3/c1-15(2)10-19-20(22(19,3)4)21(23)25-14-17-12-18(24-13-17)11-16-8-6-5-7-9-16/h5-10,12-13,19-20H,11,14H2,1-4H3
51 atoms
O  2.030355 0.960515 0.809835
O  2.644414 2.28593 -0.874785
O  -1.661307 3.19374 -0.420087
C  4.218572 -0.943515 -0.227756
C  2.890063 -1.433543 -0.695142
C  3.292383 0.021958 -0.950407
C  4.524629 -0.785982 1.241289
C  5.430194 -1.364463 -1.026778
C  1.811533 -1.844403 0.235134
C  2.637114 1.193052 -0.345455
C  0.557278 -2.13735 -0.12055
C  -0.445059 -2.604021 0.890803
C  0.033786 -2.006336 -1.516936
C  1.285667 2.029523 1.413656
C  -0.006231 2.246593 0.713877
C  -1.071671 1.298478 0.564789
C  -0.419344 3.371077 0.090104
C  -2.05088 1.924219 -0.128803
C  -3.404155 1.517246 -0.595648
C  -3.712586 0.089173 -0.238763
C  -4.094931 -0.248823 1.057302
C  -3.609641 -0.919854 -1.190914
C  -4.371467 -1.566497 1.392942
C  -3.886333 -2.24024 -0.85904
C  -4.268764 -2.566962 0.434073
H  2.92301 -2.00822 -1.616238
H  3.587529 0.236345 -1.971018
H  3.6663 -0.536171 1.858143
H  4.942003 -1.717772 1.627507
H  5.275588 -0.007857 1.389289
H  5.812017 -2.320941 -0.664389
H  5.199569 -1.478488 -2.086393
H  6.233438 -0.630858 -0.936137
H  2.078295 -1.953075 1.281823
H  -1.301066 -1.925094 0.941055
H  -0.016106 -2.678219 1.890104
H  -0.849372 -3.583425 0.622114
H  0.790769 -1.695374 -2.23508
H  -0.773533 -1.269212 -1.548319
H  -0.396911 -2.949442 -1.862837
H  1.876954 2.945335 1.453429
H  1.120623 1.694445 2.436579
H  -1.09524 0.288702 0.942313
H  0.037891 4.336677 -0.060501
H  -3.474306 1.6525 -1.678607
H  -4.153248 2.182089 -0.154257
H  -4.181084 0.527142 1.809106
H  -3.316189 -0.670407 -2.203695
H  -4.671005 -1.812089 2.40365
H  -3.804758 -3.012208 -1.613356
H  -4.487096 -3.59443 0.694643
elementType: O C H
totalener: -1079.73642726 hartree
nucrepener: 2226.43768663 hartree
electener: -3306.17411389 hartree
oneelecener: -5892.21108171 hartree
twoeener: 2586.03696781 hartree
cpcmener: -0.03199031 hartree
kineticenergy: 1074.86017951 hartree
xcener: -106.468346003426 hartree
chargesum: -0.0000000
charge: -0.270115 -0.510294 -0.290396 0.142644 -0.037347 -0.134403 -0.294081 -0.265317 -0.205649 0.440070 -0.043467 -0.224024 -0.283561 0.060415 -0.080224 -0.349651 -0.024635 0.202357 -0.008520 0.045359 -0.206471 -0.246018 -0.129672 -0.134103 -0.188596 0.112722 0.092731 0.090629 0.100833 0.103539 0.093772 0.088272 0.096060 0.126986 0.032078 0.099671 0.110143 0.099407 0.090717 0.107159 0.122803 0.117761 0.190365 0.178845 0.103991 0.111108 0.142733 0.147811 0.158042 0.158538 0.158986
qa: -0.2701 -0.5103 -0.2904 0.1426 -0.0373 -0.1344 -0.2941 -0.2653 -0.2056 0.4401 -0.0435 -0.2240 -0.2836 0.0604 -0.0802 -0.3497 -0.0246 0.2024 -0.0085 0.0454 -0.2065 -0.2460 -0.1297 -0.1341 -0.1886 0.1127 0.0927 0.0906 0.1008 0.1035 0.0938 0.0883 0.0961 0.1270 0.0321 0.0997 0.1101 0.0994 0.0907 0.1072 0.1228 0.1178 0.1904 0.1788 0.1040 0.1111 0.1427 0.1478 0.1580 0.1585 0.1590
va: 2.1102 1.9909 2.2649 3.7555 3.7796 3.8837 3.9035 3.8991 3.7801 4.0958 3.6520 3.9333 3.9414 3.8422 3.6800 3.9580 3.9595 3.6752 3.8361 3.5481 3.9196 3.9056 3.8348 3.8164 3.8758 1.0033 1.0290 1.0123 0.9987 0.9996 1.0020 1.0052 1.0019 1.0020 1.0043 1.0148 0.9956 1.0124 1.0013 0.9979 1.0058 0.9931 0.9733 0.9947 1.0096 1.0029 1.0030 1.0011 0.9897 0.9912 0.9905
dispcorr: -0.029022009 hartree
energy: -1079.765449272425
dipole: 10.14483 -10.51226 -0.36743 -18.58977 17.23637 -1.35340 1.05580 -0.29619 0.75961
magnitude: 1.59490 au
magnitude: 4.05392 debye
