program: Orca
programVersion: 5.0.2
elementType: Si F O O C C C C C C C C C C C C C C C C C C C C C C C C C H H H H H H H H H H H H H H H H H H H H H H H H H H H H H
charge: 0
multiplicity: 1
keywords: wb97x-d3
keywords: def2-TZVPP
keywords: def2/J RIJCOSX
keywords: DEFGRID2
keywords: scfconv7
keywords: smallprint printgap noloewdin
keywords: NOSOSCF
formula: C25H29FO2Si
InChI: InChI=1/C25H29FO2Si/c1-4-27-21-13-15-23(16-14-21)29(2,3)18-8-9-20-12-17-24(26)25(19-20)28-22-10-6-5-7-11-22/h5-7,10-17,19H,4,8-9,18H2,1-3H3
58 atoms
Si -3.558646 1.412709 0.074282
F  1.780027 -3.674755 -1.575135
O  2.068225 2.042252 2.191131
O  1.932397 -1.714618 0.310418
C  -3.764091 -0.21448 -0.879776
C  -4.066013 -1.44798 -0.027997
C  -1.812942 1.600718 0.735323
C  -4.78839 1.470451 1.502404
C  -3.903685 2.836956 -1.11314
C  -2.930566 -1.867263 0.906195
C  -1.507301 1.612739 2.098956
C  -0.741404 1.741981 -0.143959
C  -1.674185 -2.314144 0.204674
C  -0.21078 1.757398 2.558099
C  0.565895 1.900081 0.290419
C  0.843216 1.909412 1.65596
C  -0.440132 -1.751927 0.518651
C  -1.71449 -3.331961 -0.744356
C  0.723931 -2.212769 -0.075038
C  -0.55931 -3.791977 -1.356512
C  0.653087 -3.234785 -1.010377
C  3.170504 2.365228 1.36281
C  3.18829 3.824498 0.949505
C  2.682194 -1.008844 -0.577994
C  2.152792 -0.396939 -1.706745
C  4.03352 -0.880042 -0.280059
C  2.984236 0.352288 -2.526939
C  4.849824 -0.127242 -1.107318
C  4.331749 0.496048 -2.234533
H  -4.580965 -0.071534 -1.594944
H  -2.871632 -0.391838 -1.489476
H  -4.325413 -2.289108 -0.678212
H  -4.95834 -1.26977 0.57857
H  -5.811695 1.367203 1.137124
H  -4.627009 0.672979 2.230228
H  -4.730987 2.418766 2.038971
H  -4.911732 2.777567 -1.527172
H  -3.806719 3.801121 -0.612505
H  -3.209016 2.839463 -1.955011
H  -2.68618 -1.051544 1.591014
H  -3.286194 -2.687801 1.537242
H  -2.299136 1.51006 2.832584
H  -0.915827 1.735543 -1.215103
H  0.002401 1.764126 3.619477
H  1.351131 2.004483 -0.444926
H  -0.369385 -0.95166 1.245991
H  -2.659618 -3.790796 -1.00621
H  -0.591256 -4.590719 -2.085469
H  3.21796 1.707142 0.490293
H  4.049039 2.139775 1.967773
H  3.198041 4.478276 1.82124
H  4.086547 4.027724 0.365647
H  2.328172 4.093338 0.336736
H  1.099907 -0.486831 -1.940667
H  4.431412 -1.36668 0.60064
H  2.567565 0.827862 -3.405312
H  5.901335 -0.032165 -0.869857
H  4.972503 1.080407 -2.880607
totalener: -1510.04775935 hartree
nucrepener: 3024.77812281 hartree
electener: -4534.82588216 hartree
oneelecener: -8078.93357744 hartree
twoeener: 3544.10769528 hartree
kineticenergy: 1503.96544298 hartree
xcener: -135.245773076518 hartree
chargesum: 0.0000000
charge: 0.426975 -0.196580 -0.295467 -0.293493 -0.238794 -0.163894 -0.092123 -0.416668 -0.409757 -0.096413 -0.098287 -0.121890 -0.010429 -0.231023 -0.258641 0.330287 -0.159555 -0.119916 0.103278 -0.183775 0.277640 0.113669 -0.260484 0.313775 -0.179254 -0.226122 -0.143254 -0.098241 -0.136276 0.090618 0.076776 0.086569 0.085519 0.104300 0.089228 0.108839 0.091168 0.096446 0.087591 0.068347 0.100444 0.115936 0.095217 0.111234 0.120134 0.127923 0.109673 0.120562 -0.002182 0.098329 0.093183 0.082991 0.087215 0.125907 0.120220 0.125391 0.123299 0.123836
qa: 0.4270 -0.1966 -0.2955 -0.2935 -0.2388 -0.1639 -0.0921 -0.4167 -0.4098 -0.0964 -0.0983 -0.1219 -0.0104 -0.2310 -0.2586 0.3303 -0.1596 -0.1199 0.1033 -0.1838 0.2776 0.1137 -0.2605 0.3138 -0.1793 -0.2261 -0.1433 -0.0982 -0.1363 0.0906 0.0768 0.0866 0.0855 0.1043 0.0892 0.1088 0.0912 0.0964 0.0876 0.0683 0.1004 0.1159 0.0952 0.1112 0.1201 0.1279 0.1097 0.1206 -0.0022 0.0983 0.0932 0.0830 0.0872 0.1259 0.1202 0.1254 0.1233 0.1238
va: 4.1525 1.0984 2.1201 2.0990 3.8213 3.9119 3.6995 3.9135 3.9069 3.8078 3.8475 3.9244 3.6980 4.0534 3.9074 3.8041 3.8897 3.9041 3.8467 3.9800 3.9994 3.8842 3.9384 3.6419 3.8625 3.9778 3.9514 3.9058 3.9122 1.0076 1.0211 1.0038 1.0022 1.0117 1.0096 1.0119 1.0133 1.0131 1.0153 1.0228 1.0030 0.9954 1.0062 1.0205 0.9963 1.0030 1.0114 1.0090 1.0168 0.9964 1.0075 1.0114 1.0040 1.0128 1.0182 1.0009 0.9997 1.0003
dispcorr: -0.036229011 hartree
energy: -1510.083988360031
dipole: -19.82003 19.50692 -0.31310 23.17857 -22.76902 0.40955 2.08336 -2.45484 -0.37148
magnitude: 0.63542 au
magnitude: 1.61512 debye
