program: Orca
programVersion: 5.0.2
elementType: Si F O O C C C C C C C C C C C C C C C C C C C C C C C C C H H H H H H H H H H H H H H H H H H H H H H H H H H H H H
charge: 0
multiplicity: 1
keywords: wb97x-d3
keywords: def2-TZVPP
keywords: def2/J RIJCOSX
keywords: DEFGRID2
keywords: scfconv7
keywords: smallprint printgap noloewdin
keywords: NOSOSCF
formula: C25H29FO2Si
InChI: InChI=1/C25H29FO2Si/c1-4-27-21-13-15-23(16-14-21)29(2,3)18-8-9-20-12-17-24(26)25(19-20)28-22-10-6-5-7-11-22/h5-7,10-17,19H,4,8-9,18H2,1-3H3
58 atoms
Si -3.321236 0.273957 1.714397
F  2.492014 -0.1900 -1.962367
O  1.102597 3.603115 -0.690182
O  1.860031 -2.712205 -1.136275
C  -3.277734 -1.259192 0.60854
C  -3.68298 -0.960235 -0.840341
C  -1.961796 1.394599 1.066528
C  -2.961515 -0.214349 3.498389
C  -4.992945 1.134393 1.597101
C  -2.900236 -1.768411 -1.880813
C  -2.197949 2.498799 0.243053
C  -0.628984 1.073039 1.309764
C  -1.45038 -1.368413 -1.930737
C  -1.165288 3.225681 -0.31957
C  0.42637 1.7834 0.75771
C  0.16002 2.865943 -0.076315
C  -0.445485 -2.229681 -1.504854
C  -1.090421 -0.095099 -2.363885
C  0.884765 -1.839619 -1.518702
C  0.232751 0.309906 -2.383709
C  1.208905 -0.567426 -1.962676
C  2.46521 3.284112 -0.483077
C  3.300037 4.246764 -1.294071
C  2.55625 -2.450332 0.007423
C  2.064403 -1.636597 1.01881
C  3.790244 -3.07224 0.144903
C  2.820549 -1.442296 2.165633
C  4.530892 -2.872472 1.297579
C  4.054903 -2.054399 2.313138
H  -2.244596 -1.623139 0.643914
H  -3.889406 -2.069909 1.014166
H  -3.547684 0.101052 -1.07591
H  -4.751327 -1.150994 -0.966208
H  -2.926485 0.657618 4.152456
H  -3.727978 -0.887676 3.885936
H  -2.005042 -0.730967 3.594187
H  -5.251633 1.396328 0.569744
H  -5.789214 0.489343 1.972212
H  -5.013691 2.053317 2.184703
H  -2.986884 -2.8353 -1.660453
H  -3.35135 -1.620118 -2.866116
H  -3.215368 2.806558 0.02938
H  -0.38829 0.233324 1.953965
H  -1.370588 4.0769 -0.956449
H  1.439665 1.473901 0.975993
H  -0.686847 -3.227709 -1.15933
H  -1.853437 0.601143 -2.687899
H  0.508898 1.301221 -2.717779
H  2.669894 2.252713 -0.790461
H  2.718736 3.365341 0.580803
H  3.081314 4.161143 -2.357926
H  3.125626 5.277941 -0.98858
H  4.357566 4.026991 -1.150773
H  1.097368 -1.16179 0.919458
H  4.161767 -3.702578 -0.652245
H  2.431866 -0.808526 2.952723
H  5.493476 -3.356378 1.398426
H  4.639332 -1.899925 3.209774
totalener: -1510.04832923 hartree
nucrepener: 3021.75089299 hartree
electener: -4531.79922222 hartree
oneelecener: -8072.75028325 hartree
twoeener: 3540.95106103 hartree
kineticenergy: 1503.97022075 hartree
xcener: -135.241532831302 hartree
chargesum: -0.0000000
charge: 0.410959 -0.206004 -0.285511 -0.303618 -0.233462 -0.106254 -0.089887 -0.402584 -0.397905 -0.132911 -0.076466 -0.112455 0.099077 -0.247071 -0.225074 0.301400 -0.241353 -0.195298 0.205022 -0.123879 0.207237 0.030231 -0.255615 0.223920 -0.096782 -0.180877 -0.156666 -0.109362 -0.128007 0.067894 0.087617 0.051346 0.088972 0.099232 0.092997 0.086858 0.086843 0.098636 0.106035 0.076892 0.097159 0.114146 0.106902 0.111984 0.101827 0.114052 0.107518 0.128675 0.084545 0.087841 0.083897 0.086209 0.080972 0.088339 0.122290 0.123149 0.122814 0.123555
qa: 0.4110 -0.2060 -0.2855 -0.3036 -0.2335 -0.1063 -0.0899 -0.4026 -0.3979 -0.1329 -0.0765 -0.1125 0.0991 -0.2471 -0.2251 0.3014 -0.2414 -0.1953 0.2050 -0.1239 0.2072 0.0302 -0.2556 0.2239 -0.0968 -0.1809 -0.1567 -0.1094 -0.1280 0.0679 0.0876 0.0513 0.0890 0.0992 0.0930 0.0869 0.0868 0.0986 0.1060 0.0769 0.0972 0.1141 0.1069 0.1120 0.1018 0.1141 0.1075 0.1287 0.0845 0.0878 0.0839 0.0862 0.0810 0.0883 0.1223 0.1231 0.1228 0.1236
va: 4.2016 1.0826 2.1027 2.1119 3.8171 3.8850 3.7647 3.9070 3.9099 3.8754 3.8545 3.9343 3.5989 4.0556 3.8687 3.8337 4.0123 3.9583 3.7818 3.8532 4.0054 3.8315 3.9819 3.8818 3.8525 4.0095 3.9760 3.9657 3.9540 1.0201 1.0131 1.0097 1.0094 1.0119 1.0138 1.0155 1.0126 1.0130 1.0095 1.0113 1.0037 0.9928 0.9827 1.0192 1.0220 1.0213 1.0127 0.9979 0.9894 0.9903 1.0063 1.0058 1.0072 1.0285 1.0151 1.0032 0.9990 1.0002
dispcorr: -0.035532223 hartree
energy: -1510.083861456282
dipole: -18.59997 18.29206 -0.30791 8.58491 -8.44327 0.14164 12.02271 -11.81397 0.20874
magnitude: 0.39805 au
magnitude: 1.01177 debye
