program: Orca
programVersion: 5.0.2
elementType: Si F O O C C C C C C C C C C C C C C C C C C C C C C C C C H H H H H H H H H H H H H H H H H H H H H H H H H H H H H
charge: 0
multiplicity: 1
keywords: wb97x-d3
keywords: def2-TZVPP
keywords: def2/J RIJCOSX
keywords: DEFGRID2
keywords: scfconv7
keywords: smallprint printgap noloewdin
keywords: NOSOSCF
formula: C25H29FO2Si
InChI: InChI=1/C25H29FO2Si/c1-4-27-21-13-15-23(16-14-21)29(2,3)18-8-9-20-12-17-24(26)25(19-20)28-22-10-6-5-7-11-22/h5-7,10-17,19H,4,8-9,18H2,1-3H3
58 atoms
Si -4.065424 0.974277 0.642086
F  2.052798 -2.036345 1.426987
O  1.7639 2.458953 1.217723
O  1.63704 -0.234736 -0.586193
C  -4.081093 -0.821456 0.050872
C  -3.523621 -0.973067 -1.370436
C  -2.261063 1.454446 0.826634
C  -4.947267 1.111427 2.302885
C  -4.903078 2.08624 -0.627711
C  -2.69528 -2.245021 -1.579342
C  -1.444859 0.764138 1.720222
C  -1.65598 2.472542 0.084267
C  -1.419372 -2.227649 -0.781627
C  -0.100825 1.063047 1.885379
C  -0.317104 2.7856 0.226002
C  0.474961 2.084244 1.133944
C  -0.431919 -1.289856 -1.075274
C  -1.20258 -3.099942 0.277516
C  0.73267 -1.218962 -0.33623
C  -0.033329 -3.046951 1.027127
C  0.92285 -2.107394 0.714302
C  2.60666 1.811369 2.150063
C  3.96252 2.476204 2.100411
C  2.801037 -0.513424 -1.235802
C  3.665351 0.562601 -1.404964
C  3.13275 -1.76727 -1.728718
C  4.868087 0.374963 -2.061383
C  4.345949 -1.93745 -2.382003
C  5.219147 -0.876316 -2.551306
H  -3.467335 -1.387214 0.760814
H  -5.081458 -1.258035 0.11646
H  -2.893234 -0.117865 -1.637404
H  -4.346676 -0.960994 -2.088587
H  -4.938944 2.138504 2.670415
H  -5.989032 0.79356 2.233839
H  -4.468526 0.493508 3.064461
H  -4.439187 2.008014 -1.612296
H  -5.954636 1.818469 -0.743988
H  -4.869053 3.135827 -0.331119
H  -3.290151 -3.121402 -1.30969
H  -2.457477 -2.349329 -2.641946
H  -1.85344 -0.048303 2.312345
H  -2.240271 3.043238 -0.628699
H  0.48105 0.485465 2.590345
H  0.131267 3.576324 -0.362055
H  -0.569971 -0.576321 -1.878877
H  -1.95533 -3.837079 0.527469
H  0.133716 -3.727075 1.851776
H  2.694103 0.745727 1.912476
H  2.187983 1.891317 3.160745
H  3.893875 3.535344 2.347289
H  4.629433 2.004632 2.821766
H  4.418843 2.379424 1.115648
H  3.378433 1.53441 -1.023937
H  2.459291 -2.606956 -1.619415
H  5.536784 1.215582 -2.192143
H  4.603913 -2.917141 -2.762219
H  6.161577 -1.019829 -3.061368
totalener: -1510.04848592 hartree
nucrepener: 3029.65057696 hartree
electener: -4539.69906288 hartree
oneelecener: -8089.02865963 hartree
twoeener: 3549.32959674 hartree
kineticenergy: 1503.96028155 hartree
xcener: -135.239318509116 hartree
chargesum: 0.0000000
charge: 0.415829 -0.205628 -0.294328 -0.280281 -0.250572 -0.105187 -0.095539 -0.389164 -0.408688 -0.132470 -0.149777 -0.071937 0.062157 -0.221098 -0.227019 0.339514 -0.152971 -0.145334 0.108628 -0.140660 0.214594 0.005676 -0.245923 0.303909 -0.261650 -0.175977 -0.078844 -0.124757 -0.156914 0.063259 0.088380 0.055570 0.091811 0.096688 0.090390 0.088598 0.093331 0.098861 0.100875 0.076487 0.096358 0.095407 0.111198 0.109963 0.108237 0.106800 0.114446 0.121748 0.091413 0.095364 0.088156 0.081056 0.075864 0.137825 0.119511 0.122421 0.122679 0.121713
qa: 0.4158 -0.2056 -0.2943 -0.2803 -0.2506 -0.1052 -0.0955 -0.3892 -0.4087 -0.1325 -0.1498 -0.0719 0.0622 -0.2211 -0.2270 0.3395 -0.1530 -0.1453 0.1086 -0.1407 0.2146 0.0057 -0.2459 0.3039 -0.2617 -0.1760 -0.0788 -0.1248 -0.1569 0.0633 0.0884 0.0556 0.0918 0.0967 0.0904 0.0886 0.0933 0.0989 0.1009 0.0765 0.0964 0.0954 0.1112 0.1100 0.1082 0.1068 0.1144 0.1217 0.0914 0.0954 0.0882 0.0811 0.0759 0.1378 0.1195 0.1224 0.1227 0.1217
va: 4.2018 1.0790 2.0861 2.0567 3.8249 3.8534 3.7570 3.9001 3.9116 3.8962 3.9708 3.8610 3.6410 3.9046 4.0743 3.7592 3.9690 3.9158 3.6994 3.9610 3.9847 3.8394 3.9762 3.8217 3.9952 3.9631 3.9371 3.9766 3.9782 1.0245 1.0152 1.0095 1.0081 1.0119 1.0132 1.0142 1.0102 1.0140 1.0102 1.0094 1.0050 1.0009 0.9949 1.0150 1.0191 1.0224 1.0090 1.0075 0.9887 0.9920 1.0059 1.0084 1.0096 1.0202 1.0157 1.0016 1.0007 1.0013
dispcorr: -0.035713570 hartree
energy: -1510.084199494434
dipole: -18.96489 18.67037 -0.29452 8.68250 -9.25802 -0.57552 0.27185 -0.32567 -0.05382
magnitude: 0.64874 au
magnitude: 1.64896 debye
