program: Orca
programVersion: 5.0.2
elementType: Si F O O C C C C C C C C C C C C C C C C C C C C C C C C C H H H H H H H H H H H H H H H H H H H H H H H H H H H H H
charge: 0
multiplicity: 1
keywords: wb97x-d3
keywords: def2-TZVPP
keywords: def2/J RIJCOSX
keywords: DEFGRID2
keywords: scfconv7
keywords: smallprint printgap noloewdin
keywords: NOSOSCF
formula: C25H29FO2Si
InChI: InChI=1/C25H29FO2Si/c1-4-27-21-13-15-23(16-14-21)29(2,3)18-8-9-20-12-17-24(26)25(19-20)28-22-10-6-5-7-11-22/h5-7,10-17,19H,4,8-9,18H2,1-3H3
58 atoms
Si -3.932481 1.250902 0.740748
F  1.957191 -3.597397 1.010588
O  1.915873 2.719309 0.619784
O  1.487319 -0.939859 0.639343
C  -3.819649 -0.54226 0.141584
C  -3.310963 -0.637074 -1.299036
C  -2.165129 1.877681 0.734229
C  -4.654886 1.317649 2.479197
C  -4.992374 2.271581 -0.436979
C  -2.726398 -1.996494 -1.672872
C  -1.633836 2.622757 -0.314426
C  -1.267154 1.464874 1.725978
C  -1.482264 -2.399981 -0.91909
C  -0.280626 2.932013 -0.397359
C  0.07776 1.762404 1.667939
C  0.59156 2.489829 0.593335
C  -0.5393 -1.467342 -0.489511
C  -1.22764 -3.746776 -0.680465
C  0.6147 -1.869601 0.162812
C  -0.070872 -4.164553 -0.039221
C  0.840617 -3.221953 0.382714
C  2.552088 3.350086 -0.473965
C  2.724482 2.446342 -1.680362
C  2.736161 -0.852359 0.103567
C  3.679038 -0.160024 0.853439
C  3.073849 -1.37732 -1.136281
C  4.964524 -0.00883 0.364383
C  4.368498 -1.21879 -1.611912
C  5.320406 -0.539168 -0.86922
H  -3.132408 -1.061942 0.818355
H  -4.779084 -1.060393 0.23518
H  -2.561119 0.135442 -1.4969
H  -4.131089 -0.416968 -1.987142
H  -4.075238 0.724658 3.188327
H  -4.685437 2.340098 2.857759
H  -5.674789 0.929749 2.495807
H  -6.023821 1.91526 -0.44013
H  -5.011815 3.323671 -0.149004
H  -4.633338 2.220283 -1.466335
H  -3.488159 -2.768335 -1.531055
H  -2.497912 -1.99783 -2.744266
H  -2.280324 2.977067 -1.109755
H  -1.621482 0.879862 2.567682
H  0.070343 3.510416 -1.241209
H  0.751471 1.420397 2.442076
H  -0.688842 -0.40404 -0.635504
H  -1.946233 -4.490673 -1.001562
H  0.118559 -5.213732 0.144532
H  3.531343 3.642799 -0.094044
H  2.030731 4.275768 -0.744634
H  3.243786 2.991468 -2.469829
H  3.320254 1.569938 -1.43112
H  1.773644 2.101775 -2.085621
H  3.396134 0.258536 1.809534
H  2.341218 -1.90179 -1.735787
H  5.695219 0.527082 0.955946
H  4.628367 -1.632864 -2.577351
H  6.328079 -0.424577 -1.244633
totalener: -1510.04603984 hartree
nucrepener: 3009.38111365 hartree
electener: -4519.42715349 hartree
oneelecener: -8048.51867542 hartree
twoeener: 3529.09152193 hartree
kineticenergy: 1503.95664130 hartree
xcener: -135.242529120067 hartree
chargesum: -0.0000000
charge: 0.442626 -0.195154 -0.294378 -0.285023 -0.246185 -0.111757 -0.125446 -0.406362 -0.406863 -0.131108 -0.150625 -0.064404 0.023655 -0.211005 -0.259137 0.349184 -0.153655 -0.126258 0.104396 -0.169118 0.241387 0.012968 -0.226079 0.291496 -0.225711 -0.146431 -0.098703 -0.126482 -0.147428 0.084111 0.082740 0.068397 0.089176 0.087377 0.098931 0.091890 0.098766 0.106994 0.087194 0.074933 0.089125 0.115059 0.100782 0.106185 0.105433 0.102646 0.107605 0.120226 0.101067 0.082213 0.089219 0.067483 0.084567 0.112535 0.121103 0.122208 0.122144 0.121491
qa: 0.4426 -0.1952 -0.2944 -0.2850 -0.2462 -0.1118 -0.1254 -0.4064 -0.4069 -0.1311 -0.1506 -0.0644 0.0237 -0.2110 -0.2591 0.3492 -0.1537 -0.1263 0.1044 -0.1691 0.2414 0.0130 -0.2261 0.2915 -0.2257 -0.1464 -0.0987 -0.1265 -0.1474 0.0841 0.0827 0.0684 0.0892 0.0874 0.0989 0.0919 0.0988 0.1070 0.0872 0.0749 0.0891 0.1151 0.1008 0.1062 0.1054 0.1026 0.1076 0.1202 0.1011 0.0822 0.0892 0.0675 0.0846 0.1125 0.1211 0.1222 0.1221 0.1215
va: 4.1831 1.1022 2.0990 2.0910 3.8155 3.8812 3.7461 3.9086 3.9046 3.8930 3.9467 3.8898 3.6862 3.9328 4.0405 3.7772 3.9220 3.9341 3.8171 3.9685 4.0469 3.8828 3.9177 3.7068 3.9861 3.9118 3.9196 3.9635 3.9363 1.0142 1.0162 1.0034 1.0038 1.0161 1.0121 1.0138 1.0122 1.0106 1.0116 1.0043 0.9985 0.9970 1.0002 1.0123 1.0202 1.0173 1.0082 1.0084 0.9955 0.9986 1.0165 1.0074 1.0079 1.0217 1.0152 1.0004 1.0019 1.0018
dispcorr: -0.035460754 hartree
energy: -1510.081500596243
dipole: -20.40269 20.08909 -0.31360 17.43142 -17.28823 0.14319 -10.22793 9.30257 -0.92535
magnitude: 0.98749 au
magnitude: 2.50999 debye
