program: Orca
programVersion: 5.0.2
elementType: Si F O O C C C C C C C C C C C C C C C C C C C C C C C C C H H H H H H H H H H H H H H H H H H H H H H H H H H H H H
charge: 0
multiplicity: 1
keywords: wb97x-d3
keywords: def2-TZVPP
keywords: def2/J RIJCOSX
keywords: DEFGRID2
keywords: scfconv7
keywords: smallprint printgap noloewdin
keywords: NOSOSCF
formula: C25H29FO2Si
InChI: InChI=1/C25H29FO2Si/c1-4-27-21-13-15-23(16-14-21)29(2,3)18-8-9-20-12-17-24(26)25(19-20)28-22-10-6-5-7-11-22/h5-7,10-17,19H,4,8-9,18H2,1-3H3
58 atoms
Si -3.528987 1.367823 0.07891
F  1.528678 -3.007071 1.905903
O  2.22783 1.631995 1.894096
O  2.083675 -1.911372 -0.430036
C  -3.80798 -0.425474 -0.451811
C  -3.058685 -0.80876 -1.733036
C  -1.738041 1.508836 0.632272
C  -4.680239 1.793561 1.510906
C  -3.849354 2.538798 -1.364261
C  -2.636287 -2.284219 -1.784192
C  -1.156796 0.5132 1.428938
C  -0.92895 2.593039 0.301338
C  -1.527457 -2.56668 -0.808763
C  0.152796 0.587774 1.856227
C  0.393704 2.689992 0.718101
C  0.950176 1.671982 1.487281
C  -0.234445 -2.147357 -1.11517
C  -1.759816 -3.164783 0.421984
C  0.798159 -2.271886 -0.201291
C  -0.72778 -3.326058 1.338562
C  0.533016 -2.872544 1.026208
C  3.15336 2.553008 1.352406
C  4.537863 2.129891 1.783047
C  2.432016 -0.824566 -1.173816
C  1.613993 0.277701 -1.385904
C  3.723274 -0.846646 -1.689759
C  2.097759 1.346788 -2.126824
C  4.193964 0.232713 -2.417015
C  3.382178 1.335076 -2.64719
H  -3.478183 -1.054059 0.382264
H  -4.875709 -0.634935 -0.564043
H  -2.156934 -0.19861 -1.856226
H  -3.685967 -0.583386 -2.598791
H  -5.730524 1.712018 1.225511
H  -4.518954 1.130835 2.362542
H  -4.512353 2.812876 1.861351
H  -3.188158 2.336801 -2.2082
H  -4.875267 2.438911 -1.722441
H  -3.711743 3.583795 -1.081849
H  -3.498497 -2.922859 -1.576165
H  -2.304508 -2.530227 -2.796439
H  -1.730507 -0.361112 1.715768
H  -1.32583 3.397017 -0.308516
H  0.587936 -0.203794 2.452773
H  0.97739 3.550718 0.420549
H  -0.037211 -1.705501 -2.084342
H  -2.753654 -3.511955 0.674663
H  -0.900782 -3.796014 2.297705
H  2.936224 3.56865 1.706144
H  3.086797 2.558193 0.258744
H  5.276178 2.828012 1.389346
H  4.631975 2.117157 2.868346
H  4.775645 1.137544 1.402317
H  0.616291 0.326379 -0.971545
H  4.351099 -1.709058 -1.508313
H  1.452614 2.201498 -2.283346
H  5.200962 0.20685 -2.812223
H  3.74822 2.173993 -3.223525
totalener: -1510.04732286 hartree
nucrepener: 3064.03217790 hartree
electener: -4574.07950076 hartree
oneelecener: -8157.48237280 hartree
twoeener: 3583.40287204 hartree
kineticenergy: 1503.95768306 hartree
xcener: -135.245100383541 hartree
chargesum: 0.0000000
charge: 0.421966 -0.194278 -0.281395 -0.287715 -0.266307 -0.115210 -0.146982 -0.377959 -0.414887 -0.124901 -0.069273 -0.051564 0.135783 -0.237150 -0.294156 0.336406 -0.243248 -0.266740 0.258657 -0.088190 0.099725 0.027653 -0.254304 0.333346 -0.142676 -0.215904 -0.220639 -0.106068 -0.121038 0.065616 0.089459 0.060677 0.089221 0.089408 0.092303 0.094475 0.102000 0.100958 0.094147 0.077721 0.091836 0.109202 0.106390 0.124096 0.105422 0.134736 0.117936 0.122990 0.091803 0.079302 0.075068 0.088426 0.089766 0.111071 0.125166 0.127797 0.124398 0.125659
qa: 0.4220 -0.1943 -0.2814 -0.2877 -0.2663 -0.1152 -0.1470 -0.3780 -0.4149 -0.1249 -0.0693 -0.0516 0.1358 -0.2371 -0.2942 0.3364 -0.2432 -0.2667 0.2587 -0.0882 0.0997 0.0277 -0.2543 0.3333 -0.1427 -0.2159 -0.2206 -0.1061 -0.1210 0.0656 0.0895 0.0607 0.0892 0.0894 0.0923 0.0945 0.1020 0.1010 0.0941 0.0777 0.0918 0.1092 0.1064 0.1241 0.1054 0.1347 0.1179 0.1230 0.0918 0.0793 0.0751 0.0884 0.0898 0.1111 0.1252 0.1278 0.1244 0.1257
va: 4.1773 1.0965 2.1051 2.1354 3.8373 3.8738 3.7760 3.8979 3.9064 3.8999 3.8238 3.8496 3.5527 4.0079 3.9058 3.7733 3.9434 3.9438 3.6697 3.8535 4.0771 3.8419 3.9817 3.7419 3.8005 3.9978 3.9614 3.9425 3.9259 1.0261 1.0164 1.0051 1.0088 1.0128 1.0136 1.0139 1.0078 1.0130 1.0129 1.0099 1.0082 0.9899 0.9970 1.0184 1.0183 1.0036 1.0095 1.0057 0.9887 0.9822 1.0075 1.0069 1.0065 0.9990 1.0155 1.0052 0.9990 0.9996
dispcorr: -0.037485602 hartree
energy: -1510.084808463916
dipole: -16.17718 15.86001 -0.31717 20.49448 -19.88276 0.61172 -7.57694 6.87005 -0.70690
magnitude: 0.98717 au
magnitude: 2.50918 debye
