program: Orca
programVersion: 5.0.2
elementType: Si F O O C C C C C C C C C C C C C C C C C C C C C C C C C H H H H H H H H H H H H H H H H H H H H H H H H H H H H H
charge: 0
multiplicity: 1
keywords: wb97x-d3
keywords: def2-TZVPP
keywords: def2/J RIJCOSX
keywords: DEFGRID2
keywords: scfconv7
keywords: smallprint printgap noloewdin
keywords: NOSOSCF
formula: C25H29FO2Si
InChI: InChI=1/C25H29FO2Si/c1-4-27-21-13-15-23(16-14-21)29(2,3)18-8-9-20-12-17-24(26)25(19-20)28-22-10-6-5-7-11-22/h5-7,10-17,19H,4,8-9,18H2,1-3H3
58 atoms
Si -3.711785 1.616582 0.628793
F  2.036519 -4.418301 -1.024506
O  2.11238 2.596138 -0.671333
O  2.183515 -1.740372 -0.72633
C  -3.968312 -0.132448 1.345832
C  -2.861585 -1.141274 1.0420
C  -1.903045 1.903149 0.200727
C  -4.259622 2.876882 1.920074
C  -4.75395 1.832291 -0.928714
C  -2.695173 -1.456413 -0.446461
C  -0.89076 1.846856 1.168196
C  -1.50173 2.176787 -1.10331
C  -1.450128 -2.25975 -0.689537
C  0.437507 2.059695 0.856358
C  -0.173248 2.40205 -1.443376
C  0.807259 2.359945 -0.456999
C  -0.212819 -1.624671 -0.641498
C  -1.484561 -3.634962 -0.887259
C  0.963866 -2.34554 -0.756322
C  -0.313403 -4.367241 -1.018148
C  0.902367 -3.720633 -0.934917
C  2.558416 2.836176 -1.988172
C  4.047683 3.088842 -1.944618
C  2.573285 -1.088234 0.405806
C  3.626242 -0.194226 0.264519
C  1.994832 -1.297431 1.651553
C  4.098002 0.492538 1.368695
C  2.479788 -0.60186 2.749695
C  3.527733 0.295767 2.618696
H  -4.078584 -0.04409 2.431156
H  -4.931462 -0.515294 0.989879
H  -3.046192 -2.077941 1.57706
H  -1.909796 -0.763823 1.425011
H  -3.638967 2.826899 2.816478
H  -4.19199 3.895395 1.536088
H  -5.292275 2.708634 2.231425
H  -4.490847 1.114609 -1.707882
H  -5.811066 1.683019 -0.701732
H  -4.654572 2.832879 -1.352411
H  -3.575862 -1.990906 -0.812747
H  -2.63752 -0.526324 -1.018043
H  -1.140071 1.628772 2.201408
H  -2.237696 2.222916 -1.89753
H  1.205571 1.997343 1.617044
H  0.072319 2.613354 -2.475012
H  -0.159705 -0.550203 -0.496722
H  -2.437485 -4.146895 -0.936612
H  -0.337531 -5.438362 -1.168243
H  2.045763 3.706069 -2.417119
H  2.335162 1.975507 -2.630362
H  4.585244 2.231472 -1.540812
H  4.419979 3.273776 -2.951961
H  4.283453 3.959194 -1.333288
H  4.066178 -0.045703 -0.712732
H  1.177621 -1.995159 1.775225
H  4.913119 1.193912 1.24877
H  2.030484 -0.771968 3.719366
H  3.899535 0.832854 3.48059
totalener: -1510.04759676 hartree
nucrepener: 3001.89659535 hartree
electener: -4511.94419211 hartree
oneelecener: -8033.20197105 hartree
twoeener: 3521.25777894 hartree
kineticenergy: 1503.95466772 hartree
xcener: -135.239793519201 hartree
chargesum: -0.0000000
charge: 0.440301 -0.193416 -0.273950 -0.300626 -0.287727 -0.099815 -0.090895 -0.408740 -0.402470 -0.097898 -0.124297 -0.151050 0.020666 -0.225983 -0.188648 0.320720 -0.125729 -0.133070 0.135626 -0.170005 0.218591 0.019248 -0.259613 0.292258 -0.225938 -0.149465 -0.044700 -0.141061 -0.179181 0.095669 0.079239 0.089397 0.065919 0.089814 0.095223 0.092798 0.093582 0.099846 0.100232 0.083887 0.074214 0.106896 0.118413 0.123594 0.101751 0.064322 0.109064 0.119660 0.088251 0.092073 0.074289 0.085433 0.089446 0.116157 0.120591 0.112181 0.123487 0.121440
qa: 0.4403 -0.1934 -0.2739 -0.3006 -0.2877 -0.0998 -0.0909 -0.4087 -0.4025 -0.0979 -0.1243 -0.1510 0.0207 -0.2260 -0.1886 0.3207 -0.1257 -0.1331 0.1356 -0.1700 0.2186 0.0192 -0.2596 0.2923 -0.2259 -0.1495 -0.0447 -0.1411 -0.1792 0.0957 0.0792 0.0894 0.0659 0.0898 0.0952 0.0928 0.0936 0.0998 0.1002 0.0839 0.0742 0.1069 0.1184 0.1236 0.1018 0.0643 0.1091 0.1197 0.0883 0.0921 0.0743 0.0854 0.0894 0.1162 0.1206 0.1122 0.1235 0.1214
va: 4.1234 1.1047 2.1211 2.1162 3.8609 3.8504 3.7433 3.9037 3.8999 3.7836 3.8897 3.9601 3.7172 3.9757 3.9350 3.8288 3.9086 3.9165 3.7402 3.9284 4.0807 3.8463 3.9809 3.7753 3.9919 3.8838 3.9047 3.9350 3.9547 1.0083 1.0128 1.0117 1.0149 1.0148 1.0145 1.0115 1.0122 1.0153 1.0102 1.0148 1.0300 0.9991 0.9979 1.0164 1.0185 1.0291 1.0108 1.0082 0.9866 0.9844 1.0075 1.0091 1.0046 1.0116 1.0106 1.0019 1.0010 1.0020
dispcorr: -0.035326158 hartree
energy: -1510.082922917223
dipole: -20.07482 19.46383 -0.61098 24.44069 -23.78185 0.65884 3.15928 -3.29412 -0.13485
magnitude: 0.90860 au
magnitude: 2.30948 debye
