program: Orca
programVersion: 5.0.2
elementType: Si F O O C C C C C C C C C C C C C C C C C C C C C C C C C H H H H H H H H H H H H H H H H H H H H H H H H H H H H H
charge: 0
multiplicity: 1
keywords: wb97x-d3
keywords: def2-TZVPP
keywords: def2/J RIJCOSX
keywords: DEFGRID2
keywords: scfconv7
keywords: smallprint printgap noloewdin
keywords: NOSOSCF
formula: C25H29FO2Si
InChI: InChI=1/C25H29FO2Si/c1-4-27-21-13-15-23(16-14-21)29(2,3)18-8-9-20-12-17-24(26)25(19-20)28-22-10-6-5-7-11-22/h5-7,10-17,19H,4,8-9,18H2,1-3H3
58 atoms
Si -3.752142 1.146113 0.354362
F  1.770774 -2.678206 1.811712
O  2.041849 2.336112 1.60884
O  2.067727 -0.858053 -0.111475
C  -3.802989 -0.58612 -0.395127
C  -3.050041 -0.668602 -1.727794
C  -1.950367 1.505029 0.740807
C  -4.764409 1.186698 1.943144
C  -4.415506 2.415514 -0.871261
C  -2.34556 -2.010558 -1.954041
C  -1.291265 0.810508 1.754105
C  -1.193319 2.437419 0.027833
C  -1.2403 -2.23368 -0.957863
C  0.038805 1.040952 2.073523
C  0.134181 2.6841 0.325525
C  0.759588 1.999493 1.366238
C  -0.088163 -1.455055 -1.025931
C  -1.358397 -3.158513 0.071961
C  0.935508 -1.60451 -0.10538
C  -0.349919 -3.305423 1.015077
C  0.787304 -2.535987 0.915269
C  2.675865 1.92955 2.808865
C  3.376391 0.59003 2.701253
C  2.646596 -0.510511 -1.299578
C  3.131546 0.783283 -1.418695
C  2.801427 -1.423625 -2.335494
C  3.776219 1.161936 -2.586622
C  3.439887 -1.026816 -3.499966
C  3.92898 0.264892 -3.632956
H  -3.336579 -1.2479 0.343163
H  -4.828158 -0.949021 -0.511351
H  -2.291579 0.119096 -1.7960
H  -3.742204 -0.481071 -2.552081
H  -5.814865 0.959169 1.753497
H  -4.402895 0.458564 2.671172
H  -4.719034 2.167893 2.417213
H  -5.471847 2.236196 -1.07815
H  -4.32874 3.432723 -0.486379
H  -3.890802 2.379736 -1.827568
H  -3.072685 -2.824205 -1.891922
H  -1.936157 -2.037727 -2.967748
H  -1.819191 0.054248 2.325389
H  -1.650272 3.005484 -0.774616
H  0.495246 0.462646 2.865408
H  0.695569 3.424156 -0.230599
H  0.014371 -0.712641 -1.808696
H  -2.246729 -3.773072 0.144859
H  -0.436307 -4.025101 1.818378
H  1.962079 1.934051 3.639466
H  3.408648 2.710052 3.020462
H  2.691467 -0.238161 2.535939
H  4.096817 0.589891 1.884001
H  3.92102 0.394608 3.626021
H  3.004757 1.479474 -0.60068
H  2.431073 -2.435787 -2.235033
H  4.153671 2.171859 -2.678675
H  3.560913 -1.738621 -4.305904
H  4.427842 0.567696 -4.543552
totalener: -1510.04677862 hartree
nucrepener: 3044.91348556 hartree
electener: -4554.96026418 hartree
oneelecener: -8119.64787167 hartree
twoeener: 3564.68760749 hartree
kineticenergy: 1503.95590233 hartree
xcener: -135.239959878929 hartree
chargesum: -0.0000000
charge: 0.420168 -0.203225 -0.306318 -0.290276 -0.239942 -0.108130 -0.080948 -0.395522 -0.407966 -0.129566 -0.176640 -0.074584 0.084306 -0.176937 -0.232220 0.305369 -0.179212 -0.193191 0.173782 -0.117696 0.148443 0.010257 -0.233315 0.280415 -0.228330 -0.166641 -0.113640 -0.116133 -0.141132 0.065244 0.085509 0.056711 0.088239 0.091490 0.086541 0.097814 0.098573 0.103946 0.091598 0.075915 0.093941 0.096068 0.113327 0.112996 0.113515 0.119839 0.115156 0.120439 0.076831 0.097889 0.077044 0.082659 0.089633 0.135545 0.129376 0.124433 0.124658 0.123894
qa: 0.4202 -0.2032 -0.3063 -0.2903 -0.2399 -0.1081 -0.0809 -0.3955 -0.4080 -0.1296 -0.1766 -0.0746 0.0843 -0.1769 -0.2322 0.3054 -0.1792 -0.1932 0.1738 -0.1177 0.1484 0.0103 -0.2333 0.2804 -0.2283 -0.1666 -0.1136 -0.1161 -0.1411 0.0652 0.0855 0.0567 0.0882 0.0915 0.0865 0.0978 0.0986 0.1039 0.0916 0.0759 0.0939 0.0961 0.1133 0.1130 0.1135 0.1198 0.1152 0.1204 0.0768 0.0979 0.0770 0.0827 0.0896 0.1355 0.1294 0.1244 0.1247 0.1239
va: 4.1971 1.0890 2.0820 2.0614 3.8303 3.8706 3.7500 3.9038 3.9120 3.9014 4.0082 3.8735 3.6529 3.8863 4.0431 3.7671 3.8801 3.9274 3.6371 3.9152 4.0740 3.8960 3.9125 3.7834 3.9707 3.9802 3.9770 3.9548 3.9595 1.0242 1.0143 1.0106 1.0086 1.0132 1.0151 1.0114 1.0135 1.0096 1.0103 1.0092 1.0057 1.0024 0.9944 1.0095 1.0162 1.0138 1.0092 1.0068 1.0005 0.9928 1.0165 1.0057 1.0153 1.0307 1.0043 1.0013 0.9999 1.0003
dispcorr: -0.036142924 hartree
energy: -1510.082921547425
dipole: -19.67744 19.30636 -0.37108 10.50008 -10.63427 -0.13419 -2.47118 2.20145 -0.26973
magnitude: 0.47797 au
magnitude: 1.21491 debye
