program: Orca
programVersion: 5.0.2
elementType: Si F O O C C C C C C C C C C C C C C C C C C C C C C C C C H H H H H H H H H H H H H H H H H H H H H H H H H H H H H
charge: 0
multiplicity: 1
keywords: wb97x-d3
keywords: def2-TZVPP
keywords: def2/J RIJCOSX
keywords: DEFGRID2
keywords: scfconv7
keywords: smallprint printgap noloewdin
keywords: NOSOSCF
formula: C25H29FO2Si
InChI: InChI=1/C25H29FO2Si/c1-4-27-21-13-15-23(16-14-21)29(2,3)18-8-9-20-12-17-24(26)25(19-20)28-22-10-6-5-7-11-22/h5-7,10-17,19H,4,8-9,18H2,1-3H3
58 atoms
Si -3.370701 1.328014 0.794503
F  1.145949 -4.905748 0.556213
O  2.139558 3.806109 0.988451
O  1.98032 -2.984776 -1.148075
C  -3.239657 -0.381164 -0.007304
C  -2.766692 -0.363777 -1.458215
C  -1.678423 2.141087 0.847204
C  -4.036595 1.124281 2.545544
C  -4.543051 2.404633 -0.217623
C  -2.675064 -1.755846 -2.094032
C  -0.926317 2.223533 2.023616
C  -1.097616 2.672882 -0.302051
C  -1.665281 -2.635825 -1.413295
C  0.331949 2.793957 2.050654
C  0.168564 3.241547 -0.303953
C  0.896851 3.300923 0.880424
C  -0.305971 -2.406594 -1.59928
C  -2.051429 -3.660241 -0.556592
C  0.647902 -3.167307 -0.942608
C  -1.109239 -4.435406 0.102718
C  0.232453 -4.177469 -0.086046
C  2.793763 4.267016 -0.175919
C  4.181765 4.717337 0.213765
C  2.556113 -1.798919 -0.795225
C  2.006055 -0.928439 0.136671
C  3.770043 -1.501266 -1.402535
C  2.684176 0.238213 0.45941
C  4.434783 -0.333291 -1.069261
C  3.897033 0.543851 -0.137234
H  -2.562896 -0.993453 0.597851
H  -4.219013 -0.870763 0.05514
H  -1.785868 0.117957 -1.521863
H  -3.444029 0.244148 -2.065665
H  -3.41516 0.457923 3.145844
H  -4.099602 2.078912 3.069647
H  -5.039768 0.695241 2.529503
H  -4.689829 3.377401 0.253243
H  -4.169213 2.589316 -1.226059
H  -5.523763 1.936322 -0.319478
H  -3.658918 -2.231412 -2.063556
H  -2.416867 -1.650903 -3.151546
H  -1.329325 1.835261 2.951931
H  -1.638607 2.652374 -1.241806
H  0.895177 2.848815 2.973897
H  0.568062 3.627015 -1.231694
H  0.026253 -1.618663 -2.266048
H  -3.104033 -3.858931 -0.400068
H  -1.408985 -5.233128 0.769154
H  2.238092 5.099915 -0.623654
H  2.84901 3.467005 -0.923765
H  4.710385 5.087004 -0.664323
H  4.146154 5.520515 0.948884
H  4.76243 3.896358 0.63412
H  1.061108 -1.146507 0.616427
H  4.186291 -2.190106 -2.125717
H  2.253323 0.90619 1.191681
H  5.381288 -0.109421 -1.543902
H  4.421974 1.451629 0.129255
totalener: -1510.05029124 hartree
nucrepener: 2908.93791676 hartree
electener: -4418.98820800 hartree
oneelecener: -7847.01901073 hartree
twoeener: 3428.03080273 hartree
kineticenergy: 1503.95952641 hartree
xcener: -135.237294670092 hartree
chargesum: 0.0000000
charge: 0.441979 -0.191938 -0.281678 -0.296864 -0.216948 -0.123448 -0.099602 -0.432603 -0.387819 -0.136136 -0.046459 -0.161222 0.032225 -0.272513 -0.163624 0.265842 -0.154808 -0.151490 0.127051 -0.151971 0.209063 0.001155 -0.253437 0.261818 -0.134084 -0.204754 -0.151999 -0.098009 -0.178308 0.083124 0.071181 0.069781 0.084695 0.090825 0.102587 0.095680 0.103661 0.083507 0.097170 0.075477 0.095884 0.110856 0.110386 0.119284 0.101844 0.119970 0.109469 0.121534 0.098302 0.088898 0.081262 0.091225 0.081779 0.120205 0.123634 0.158079 0.120965 0.139317
qa: 0.4420 -0.1919 -0.2817 -0.2969 -0.2169 -0.1234 -0.0996 -0.4326 -0.3878 -0.1361 -0.0465 -0.1612 0.0322 -0.2725 -0.1636 0.2658 -0.1548 -0.1515 0.1271 -0.1520 0.2091 0.0012 -0.2534 0.2618 -0.1341 -0.2048 -0.1520 -0.0980 -0.1783 0.0831 0.0712 0.0698 0.0847 0.0908 0.1026 0.0957 0.1037 0.0835 0.0972 0.0755 0.0959 0.1109 0.1104 0.1193 0.1018 0.1200 0.1095 0.1215 0.0983 0.0889 0.0813 0.0912 0.0818 0.1202 0.1236 0.1581 0.1210 0.1393
va: 4.1895 1.1066 2.0851 2.1152 3.8012 3.8649 3.7892 3.9317 3.8886 3.9039 3.8649 4.0035 3.6454 4.0119 3.9325 3.8329 3.9496 3.9064 3.7864 3.9184 4.0987 3.8478 3.9776 3.7880 3.8899 4.0250 3.9487 3.9542 3.9447 1.0182 1.0167 1.0067 1.0068 1.0128 1.0110 1.0152 1.0118 1.0150 1.0088 1.0124 1.0070 0.9949 0.9937 1.0181 1.0191 1.0119 1.0111 1.0068 0.9904 0.9813 1.0065 1.0059 1.0083 1.0171 1.0144 0.9831 1.0002 0.9912
dispcorr: -0.031738374 hartree
energy: -1510.082029616633
dipole: -15.40080 14.86889 -0.53191 30.03361 -29.09598 0.93763 -1.27630 0.74473 -0.53157
magnitude: 1.20194 au
magnitude: 3.05508 debye
