program: Orca
programVersion: 5.0.2
elementType: Si F O O C C C C C C C C C C C C C C C C C C C C C C C C C H H H H H H H H H H H H H H H H H H H H H H H H H H H H H
charge: 0
multiplicity: 1
keywords: wb97x-d3
keywords: def2-TZVPP
keywords: def2/J RIJCOSX
keywords: DEFGRID2
keywords: scfconv7
keywords: smallprint printgap noloewdin
keywords: NOSOSCF
formula: C25H29FO2Si
InChI: InChI=1/C25H29FO2Si/c1-4-27-21-13-15-23(16-14-21)29(2,3)18-8-9-20-12-17-24(26)25(19-20)28-22-10-6-5-7-11-22/h5-7,10-17,19H,4,8-9,18H2,1-3H3
58 atoms
Si -3.262804 1.130472 1.075012
F  1.872911 -3.987159 -0.636316
O  2.244547 2.83732 -0.729306
O  1.987107 -1.272009 -0.877192
C  -3.431784 -0.755163 0.915143
C  -3.886976 -1.284424 -0.445688
C  -1.584109 1.723796 0.484009
C  -3.446339 1.572832 2.899778
C  -4.621912 1.975717 0.076937
C  -2.866988 -1.112815 -1.574284
C  -0.436052 1.476398 1.245206
C  -1.399438 2.387652 -0.724907
C  -1.590684 -1.876786 -1.345005
C  0.82147 1.857444 0.824578
C  -0.142313 2.770283 -1.17806
C  0.982973 2.502372 -0.402035
C  -0.374967 -1.219826 -1.1939
C  -1.604416 -3.267221 -1.267258
C  0.795612 -1.927934 -0.972624
C  -0.443868 -3.987123 -1.035674
C  0.749522 -3.310707 -0.884149
C  2.543635 3.269368 -2.040005
C  2.501011 2.146262 -3.059103
C  2.492113 -0.997619 0.357345
C  1.858675 -1.341078 1.544064
C  3.699101 -0.309137 0.381666
C  2.441767 -0.986293 2.75256
C  4.267067 0.037085 1.594437
C  3.642859 -0.296591 2.789402
H  -2.485652 -1.227101 1.201267
H  -4.155046 -1.075049 1.672981
H  -4.817445 -0.792307 -0.742516
H  -4.135121 -2.346957 -0.358543
H  -2.696137 1.075063 3.516441
H  -3.336346 2.64576 3.060476
H  -4.424264 1.277892 3.284157
H  -4.556943 1.7572 -0.990645
H  -5.60925 1.64996 0.409077
H  -4.581134 3.059703 0.191873
H  -3.322629 -1.448383 -2.510715
H  -2.63434 -0.054418 -1.713542
H  -0.513904 0.962336 2.196955
H  -2.252735 2.618416 -1.353036
H  1.693378 1.652743 1.4326
H  -0.065194 3.278124 -2.130095
H  -0.323269 -0.138917 -1.247997
H  -2.536579 -3.80455 -1.391404
H  -0.457617 -5.067096 -0.973637
H  3.553791 3.674588 -1.97619
H  1.894228 4.099208 -2.341748
H  3.174149 1.337858 -2.775331
H  1.504348 1.721082 -3.171156
H  2.814755 2.521191 -4.033778
H  0.910768 -1.862152 1.540677
H  4.177781 -0.041858 -0.550917
H  1.943049 -1.255025 3.67473
H  5.204056 0.577968 1.604537
H  4.089177 -0.023467 3.735742
totalener: -1510.04681971 hartree
nucrepener: 3055.20383261 hartree
electener: -4565.25065232 hartree
oneelecener: -8139.95199882 hartree
twoeener: 3574.70134650 hartree
kineticenergy: 1503.96568035 hartree
xcener: -135.245566240504 hartree
chargesum: 0.0000000
charge: 0.424751 -0.193733 -0.286669 -0.302553 -0.240113 -0.157416 -0.089476 -0.418170 -0.412988 -0.123950 -0.072745 -0.158977 -0.064124 -0.238936 -0.208516 0.312027 -0.068503 -0.088695 0.089727 -0.203406 0.281431 0.011911 -0.238726 0.356071 -0.196967 -0.230750 -0.132688 -0.072086 -0.168775 0.077063 0.091652 0.083236 0.087362 0.088695 0.098005 0.091697 0.085530 0.103704 0.111383 0.101111 0.073502 0.098309 0.115304 0.133996 0.104398 0.100888 0.110718 0.120280 0.099489 0.072722 0.086284 0.083340 0.086439 0.112442 0.111690 0.123171 0.119251 0.121388
qa: 0.4248 -0.1937 -0.2867 -0.3026 -0.2401 -0.1574 -0.0895 -0.4182 -0.4130 -0.1240 -0.0727 -0.1590 -0.0641 -0.2389 -0.2085 0.3120 -0.0685 -0.0887 0.0897 -0.2034 0.2814 0.0119 -0.2387 0.3561 -0.1970 -0.2307 -0.1327 -0.0721 -0.1688 0.0771 0.0917 0.0832 0.0874 0.0887 0.0980 0.0917 0.0855 0.1037 0.1114 0.1011 0.0735 0.0983 0.1153 0.1340 0.1044 0.1009 0.1107 0.1203 0.0995 0.0727 0.0863 0.0833 0.0864 0.1124 0.1117 0.1232 0.1193 0.1214
va: 4.1568 1.1043 2.1148 2.0996 3.8116 3.8994 3.6940 3.9114 3.9062 3.8280 3.8764 3.9253 3.7260 4.0079 3.9016 3.8333 3.8630 3.8701 3.7908 3.9912 4.0239 3.9113 3.9155 3.6661 3.8900 4.0016 3.9502 3.9389 3.9700 1.0224 1.0062 1.0036 1.0039 1.0156 1.0128 1.0133 1.0103 1.0109 1.0118 1.0053 1.0195 1.0022 0.9963 1.0051 1.0122 0.9865 1.0084 1.0093 0.9942 0.9952 1.0086 1.0066 1.0137 1.0210 1.0152 1.0007 1.0007 1.0022
dispcorr: -0.037026233 hartree
energy: -1510.083845945820
dipole: -22.14679 21.46189 -0.68489 18.50857 -18.10129 0.40729 0.54549 -0.92815 -0.38267
magnitude: 0.88396 au
magnitude: 2.24686 debye
