program: Orca
programVersion: 5.0.2
elementType: Si F O O C C C C C C C C C C C C C C C C C C C C C C C C C H H H H H H H H H H H H H H H H H H H H H H H H H H H H H
charge: 0
multiplicity: 1
keywords: wb97x-d3
keywords: def2-TZVPP
keywords: def2/J RIJCOSX
keywords: DEFGRID2
keywords: scfconv7
keywords: smallprint printgap noloewdin
keywords: NOSOSCF
formula: C25H29FO2Si
InChI: InChI=1/C25H29FO2Si/c1-4-27-21-13-15-23(16-14-21)29(2,3)18-8-9-20-12-17-24(26)25(19-20)28-22-10-6-5-7-11-22/h5-7,10-17,19H,4,8-9,18H2,1-3H3
58 atoms
Si -3.69656 1.739379 0.667529
F  1.256178 -4.757366 -2.592691
O  1.937986 3.87378 0.217904
O  2.190204 -3.204562 -0.636077
C  -3.53751 -0.046339 1.278184
C  -2.614291 -0.880636 0.394312
C  -1.961582 2.44732 0.54358
C  -4.72155 2.74491 1.888543
C  -4.514273 1.765345 -1.030976
C  -2.395669 -2.310929 0.895811
C  -1.41412 2.894604 -0.661837
C  -1.136258 2.500278 1.66484
C  -1.429713 -3.045256 0.010406
C  -0.119591 3.37097 -0.744728
C  0.168763 2.969832 1.607991
C  0.685727 3.410824 0.392819
C  -0.064658 -2.805354 0.134585
C  -1.866217 -3.900896 -0.993309
C  0.847225 -3.374845 -0.739975
C  -0.963911 -4.491438 -1.866755
C  0.380791 -4.214762 -1.743889
C  2.830582 3.880267 1.312489
C  4.158255 4.412534 0.825216
C  2.72314 -1.969773 -0.410158
C  3.953424 -1.944804 0.234227
C  2.125888 -0.787199 -0.830313
C  4.587254 -0.733816 0.45515
C  2.768041 0.419361 -0.59286
C  3.997591 0.454107 0.047232
H  -3.154874 -0.035507 2.305343
H  -4.529679 -0.506972 1.337621
H  -1.641388 -0.386738 0.312695
H  -3.008017 -0.927308 -0.625869
H  -5.72216 2.328175 2.015578
H  -4.255581 2.777248 2.874906
H  -4.834095 3.77627 1.551617
H  -5.515548 1.333993 -0.983571
H  -4.620344 2.781766 -1.413482
H  -3.950488 1.192747 -1.769037
H  -2.018515 -2.279258 1.922068
H  -3.351948 -2.838953 0.934344
H  -2.008923 2.872216 -1.567477
H  -1.507651 2.161096 2.62657
H  0.285098 3.715442 -1.688185
H  0.763902 2.979961 2.510901
H  0.294968 -2.150382 0.920034
H  -2.923418 -4.108225 -1.102043
H  -1.300401 -5.156238 -2.651187
H  2.949104 2.866709 1.714287
H  2.443959 4.512118 2.121235
H  4.560582 3.797865 0.019894
H  4.064861 5.433612 0.457024
H  4.880163 4.41329 1.641431
H  4.406699 -2.87558 0.548933
H  1.172261 -0.796214 -1.341695
H  5.548152 -0.721258 0.952592
H  2.300872 1.337965 -0.921013
H  4.497389 1.398173 0.218113
totalener: -1510.05062966 hartree
nucrepener: 2864.08443348 hartree
electener: -4374.13506315 hartree
oneelecener: -7757.20026496 hartree
twoeener: 3383.06520181 hartree
kineticenergy: 1503.94972379 hartree
xcener: -135.234255661700 hartree
chargesum: 0.0000000
charge: 0.437527 -0.192986 -0.284618 -0.292300 -0.262566 -0.110196 -0.151120 -0.382944 -0.416692 -0.087975 -0.025080 -0.122024 0.079082 -0.259755 -0.185294 0.280017 -0.236389 -0.180809 0.191160 -0.140818 0.172078 0.000201 -0.264278 0.277852 -0.216547 -0.163355 -0.107236 -0.124834 -0.167099 0.072052 0.078510 0.078273 0.081969 0.092153 0.088533 0.096719 0.100695 0.101227 0.094297 0.080598 0.072714 0.113332 0.098467 0.117523 0.104596 0.126742 0.109773 0.120673 0.086919 0.101319 0.083700 0.094793 0.085718 0.124447 0.129657 0.122267 0.147649 0.131687
qa: 0.4375 -0.1930 -0.2846 -0.2923 -0.2626 -0.1102 -0.1511 -0.3829 -0.4167 -0.0880 -0.0251 -0.1220 0.0791 -0.2598 -0.1853 0.2800 -0.2364 -0.1808 0.1912 -0.1408 0.1721 0.0002 -0.2643 0.2779 -0.2165 -0.1634 -0.1072 -0.1248 -0.1671 0.0721 0.0785 0.0783 0.0820 0.0922 0.0885 0.0967 0.1007 0.1012 0.0943 0.0806 0.0727 0.1133 0.0985 0.1175 0.1046 0.1267 0.1098 0.1207 0.0869 0.1013 0.0837 0.0948 0.0857 0.1244 0.1297 0.1223 0.1476 0.1317
va: 4.1801 1.1047 2.0803 2.1252 3.8448 3.8169 3.8167 3.9014 3.9154 3.8297 3.8329 3.9845 3.6635 4.0393 3.9427 3.8216 3.9549 3.9576 3.7466 3.9046 4.1049 3.8410 3.9765 3.7997 4.0379 3.9288 3.9783 3.9226 3.9443 1.0187 1.0211 1.0114 1.0080 1.0121 1.0143 1.0117 1.0130 1.0102 1.0091 1.0116 1.0153 0.9952 1.0016 1.0184 1.0182 1.0085 1.0108 1.0073 0.9822 0.9908 1.0053 1.0066 1.0056 1.0145 1.0081 1.0010 0.9947 0.9943
dispcorr: -0.030345553 hartree
energy: -1510.080975218076
dipole: -16.04556 15.66063 -0.38493 29.20044 -28.42406 0.77638 14.43601 -13.57382 0.86220
magnitude: 1.22242 au
magnitude: 3.10716 debye
