program: Orca
programVersion: 5.0.2
elementType: Si F O O C C C C C C C C C C C C C C C C C C C C C C C C C H H H H H H H H H H H H H H H H H H H H H H H H H H H H H
charge: 0
multiplicity: 1
keywords: wb97x-d3
keywords: def2-TZVPP
keywords: def2/J RIJCOSX
keywords: DEFGRID2
keywords: scfconv7
keywords: smallprint printgap noloewdin
keywords: NOSOSCF
formula: C25H29FO2Si
InChI: InChI=1/C25H29FO2Si/c1-4-27-21-13-15-23(16-14-21)29(2,3)18-8-9-20-12-17-24(26)25(19-20)28-22-10-6-5-7-11-22/h5-7,10-17,19H,4,8-9,18H2,1-3H3
58 atoms
Si -3.734771 1.81703 0.398784
F  1.449752 -5.33713 0.499796
O  1.99825 3.484289 1.306967
O  2.196888 -3.213976 -0.935677
C  -3.631596 0.391461 -0.844823
C  -2.653766 -0.695178 -0.401542
C  -1.984848 2.422043 0.711819
C  -4.49107 1.195522 2.009979
C  -4.785274 3.216676 -0.300372
C  -2.502142 -1.837965 -1.40948
C  -1.23097 1.972221 1.800809
C  -1.344476 3.274428 -0.183309
C  -1.46394 -2.825441 -0.958417
C  0.086913 2.343457 1.981632
C  -0.020406 3.663092 -0.024628
C  0.706092 3.191582 1.064019
C  -0.117325 -2.565202 -1.192607
C  -1.806615 -3.964018 -0.239348
C  0.872496 -3.403415 -0.702622
C  -0.828225 -4.820599 0.244479
C  0.500539 -4.529886 0.021442
C  2.707265 4.294437 0.393058
C  4.129463 4.416489 0.888703
C  2.73092 -1.959067 -0.873768
C  2.305739 -1.004206 0.041955
C  3.773653 -1.680824 -1.746779
C  2.927059 0.234674 0.069412
C  4.390911 -0.440573 -1.702748
C  3.967908 0.523968 -0.800371
H  -4.627733 -0.034661 -1.008476
H  -3.315974 0.795138 -1.813551
H  -2.964062 -1.118453 0.559194
H  -1.669062 -0.252738 -0.225064
H  -3.95359 0.339138 2.42004
H  -4.499977 1.973714 2.774734
H  -5.524059 0.878556 1.855462
H  -4.83508 4.056873 0.393699
H  -4.393374 3.596971 -1.245112
H  -5.808062 2.8858 -0.488918
H  -3.465124 -2.336574 -1.548081
H  -2.227337 -1.422823 -2.383229
H  -1.678387 1.3089 2.532203
H  -1.881562 3.658136 -1.043849
H  0.652397 1.9830 2.831968
H  0.42319 4.326381 -0.754646
H  0.166883 -1.686032 -1.759483
H  -2.849006 -4.189668 -0.051591
H  -1.090915 -5.708339 0.804457
H  2.243318 5.28525 0.319246
H  2.689069 3.847809 -0.608423
H  4.707631 5.040948 0.20825
H  4.166018 4.872635 1.877371
H  4.613992 3.441645 0.945158
H  1.497842 -1.217349 0.729871
H  4.0959 -2.438178 -2.449326
H  2.596977 0.976154 0.783315
H  5.204601 -0.229112 -2.384161
H  4.450181 1.492243 -0.770423
totalener: -1510.05042821 hartree
nucrepener: 2858.13646065 hartree
electener: -4368.18688886 hartree
oneelecener: -7745.35976244 hartree
twoeener: 3377.17287357 hartree
kineticenergy: 1503.94869826 hartree
xcener: -135.233365500916 hartree
chargesum: 0.0000000
charge: 0.445446 -0.193418 -0.292017 -0.293484 -0.231697 -0.129696 -0.158355 -0.398472 -0.414006 -0.092881 -0.025342 -0.099899 0.082890 -0.288092 -0.217503 0.322994 -0.219486 -0.187275 0.177750 -0.143562 0.174679 0.006458 -0.257413 0.270355 -0.174482 -0.217440 -0.088463 -0.099445 -0.167875 0.073782 0.071236 0.082932 0.083580 0.084686 0.107587 0.098009 0.100791 0.085631 0.093717 0.075033 0.079052 0.113888 0.101012 0.120486 0.105257 0.125921 0.109928 0.120590 0.099672 0.088163 0.083116 0.093385 0.081737 0.125839 0.124312 0.143404 0.122379 0.114606
qa: 0.4454 -0.1934 -0.2920 -0.2935 -0.2317 -0.1297 -0.1584 -0.3985 -0.4140 -0.0929 -0.0253 -0.0999 0.0829 -0.2881 -0.2175 0.3230 -0.2195 -0.1873 0.1778 -0.1436 0.1747 0.0065 -0.2574 0.2704 -0.1745 -0.2174 -0.0885 -0.0994 -0.1679 0.0738 0.0712 0.0829 0.0836 0.0847 0.1076 0.0980 0.1008 0.0856 0.0937 0.0750 0.0791 0.1139 0.1010 0.1205 0.1053 0.1259 0.1099 0.1206 0.0997 0.0882 0.0831 0.0934 0.0817 0.1258 0.1243 0.1434 0.1224 0.1146
va: 4.1849 1.1039 2.0860 2.1208 3.8210 3.8528 3.8039 3.8995 3.9155 3.8354 3.8094 3.9975 3.6641 4.0429 3.9811 3.7858 3.9404 3.9589 3.7566 3.9095 4.0983 3.8390 3.9794 3.7990 3.9525 4.0426 3.8989 3.9779 3.9895 1.0195 1.0184 1.0061 1.0079 1.0142 1.0085 1.0129 1.0109 1.0161 1.0132 1.0137 1.0125 0.9953 1.0009 1.0167 1.0186 1.0089 1.0106 1.0074 0.9895 0.9835 1.0063 1.0069 1.0053 1.0105 1.0139 0.9997 1.0002 1.0013
dispcorr: -0.030078079 hartree
energy: -1510.080506293387
dipole: -17.22671 16.76144 -0.46527 33.02433 -31.76965 1.25468 -0.09250 -0.31943 -0.41193
magnitude: 1.40014 au
magnitude: 3.55887 debye
