program: Orca
programVersion: 5.0.2
elementType: Si F O O C C C C C C C C C C C C C C C C C C C C C C C C C H H H H H H H H H H H H H H H H H H H H H H H H H H H H H
charge: 0
multiplicity: 1
keywords: wb97x-d3
keywords: def2-TZVPP
keywords: def2/J RIJCOSX
keywords: DEFGRID2
keywords: scfconv7
keywords: smallprint printgap noloewdin
keywords: NOSOSCF
formula: C25H29FO2Si
InChI: InChI=1/C25H29FO2Si/c1-4-27-21-13-15-23(16-14-21)29(2,3)18-8-9-20-12-17-24(26)25(19-20)28-22-10-6-5-7-11-22/h5-7,10-17,19H,4,8-9,18H2,1-3H3
58 atoms
Si -3.333451 1.226762 0.816588
F  0.929575 -5.079714 0.292202
O  2.246578 3.151249 -0.489769
O  1.434069 -2.564498 1.026126
C  -3.614425 -0.597471 0.385518
C  -3.666429 -0.959056 -1.100475
C  -1.61237 1.840949 0.380301
C  -3.584161 1.423284 2.674866
C  -4.604363 2.267838 -0.109978
C  -2.302121 -0.98784 -1.798649
C  -0.496401 1.497668 1.154656
C  -1.378048 2.655726 -0.722673
C  -1.405847 -2.072813 -1.267348
C  0.775725 1.934525 0.845305
C  -0.108191 3.11408 -1.053772
C  0.980229 2.755706 -0.265186
C  -0.36001 -1.779466 -0.399936
C  -1.6406 -3.403548 -1.602173
C  0.440148 -2.786694 0.125978
C  -0.857503 -4.418154 -1.078397
C  0.175967 -4.104448 -0.219827
C  2.520002 3.983515 -1.594914
C  4.007977 4.243216 -1.629686
C  2.312177 -1.533824 0.871099
C  2.897376 -1.047344 2.033182
C  2.66837 -1.007637 -0.36494
C  3.84073 -0.034933 1.955786
C  3.60172 0.015541 -0.423444
C  4.192726 0.508815 0.72914
H  -2.876311 -1.222344 0.898695
H  -4.574348 -0.860502 0.84435
H  -4.318039 -0.261782 -1.635622
H  -4.131673 -1.942876 -1.218364
H  -4.585738 1.113243 2.977626
H  -2.876198 0.822026 3.247731
H  -3.451683 2.461107 2.982969
H  -4.504843 2.18568 -1.193698
H  -5.618674 1.952329 0.140633
H  -4.518754 3.324608 0.146938
H  -2.461916 -1.146386 -2.868705
H  -1.808246 -0.018842 -1.703133
H  -0.615818 0.864287 2.027296
H  -2.202997 2.959245 -1.356941
H  1.62431 1.645916 1.45202
H  0.007276 3.750266 -1.920659
H  -0.165914 -0.748382 -0.127922
H  -2.446515 -3.653898 -2.281098
H  -1.035445 -5.453553 -1.336813
H  1.971713 4.9299 -1.509357
H  2.198306 3.505396 -2.528371
H  4.252986 4.884909 -2.475623
H  4.344524 4.740651 -0.720802
H  4.568001 3.314678 -1.739905
H  2.617342 -1.472835 2.987882
H  2.225417 -1.385405 -1.276587
H  4.294789 0.336765 2.865011
H  3.866707 0.429644 -1.387113
H  4.913428 1.312688 0.672115
totalener: -1510.04804528 hartree
nucrepener: 2978.57617203 hartree
electener: -4488.62421731 hartree
oneelecener: -7986.61299276 hartree
twoeener: 3497.98877545 hartree
kineticenergy: 1503.95299882 hartree
xcener: -135.241999160790 hartree
chargesum: -0.0000000
charge: 0.456054 -0.193205 -0.275750 -0.290638 -0.258433 -0.143198 -0.174448 -0.409179 -0.421006 -0.111887 -0.067309 -0.118000 0.002342 -0.262159 -0.203145 0.323037 -0.188420 -0.157678 0.215175 -0.167234 0.184695 0.032629 -0.263134 0.275113 -0.230600 -0.140729 -0.096559 -0.124757 -0.134552 0.085537 0.091289 0.079222 0.088016 0.092754 0.089325 0.100236 0.083506 0.102172 0.109348 0.094554 0.079760 0.114923 0.114759 0.142826 0.103934 0.121872 0.112183 0.119303 0.086189 0.078180 0.084190 0.090539 0.077858 0.122634 0.127864 0.123642 0.113362 0.112998
qa: 0.4561 -0.1932 -0.2757 -0.2906 -0.2584 -0.1432 -0.1744 -0.4092 -0.4210 -0.1119 -0.0673 -0.1180 0.0023 -0.2622 -0.2031 0.3230 -0.1884 -0.1577 0.2152 -0.1672 0.1847 0.0326 -0.2631 0.2751 -0.2306 -0.1407 -0.0966 -0.1248 -0.1346 0.0855 0.0913 0.0792 0.0880 0.0928 0.0893 0.1002 0.0835 0.1022 0.1093 0.0946 0.0798 0.1149 0.1148 0.1428 0.1039 0.1219 0.1122 0.1193 0.0862 0.0782 0.0842 0.0905 0.0779 0.1226 0.1279 0.1236 0.1134 0.1130
va: 4.1920 1.1045 2.1250 2.1295 3.8271 3.8932 3.7611 3.9068 3.9113 3.8542 3.8345 3.9282 3.7416 3.9963 3.9601 3.8683 3.8286 3.9294 3.6729 3.9349 4.0915 3.8504 3.9845 3.7795 3.9957 3.9018 3.9151 3.9086 3.9270 1.0181 1.0105 1.0045 1.0012 1.0126 1.0148 1.0103 1.0098 1.0112 1.0098 1.0076 1.0187 0.9994 0.9969 1.0062 1.0179 1.0086 1.0075 1.0084 0.9859 0.9842 1.0092 1.0042 1.0045 1.0163 1.0056 0.9992 1.0012 1.0043
dispcorr: -0.034425797 hartree
energy: -1510.082471078027
dipole: -15.03771 14.79004 -0.24767 29.89431 -28.69371 1.20059 -6.05365 5.17168 -0.88196
magnitude: 1.51017 au
magnitude: 3.83856 debye
