program: Orca
programVersion: 5.0.2
elementType: Si F O O C C C C C C C C C C C C C C C C C C C C C C C C C H H H H H H H H H H H H H H H H H H H H H H H H H H H H H
charge: 0
multiplicity: 1
keywords: wb97x-d3
keywords: def2-TZVPP
keywords: def2/J RIJCOSX
keywords: DEFGRID2
keywords: scfconv7
keywords: smallprint printgap noloewdin
keywords: NOSOSCF
formula: C25H29FO2Si
InChI: InChI=1/C25H29FO2Si/c1-4-27-21-13-15-23(16-14-21)29(2,3)18-8-9-20-12-17-24(26)25(19-20)28-22-10-6-5-7-11-22/h5-7,10-17,19H,4,8-9,18H2,1-3H3
58 atoms
Si -3.754314 1.72678 0.92276
F  1.442199 -4.351717 -2.981975
O  1.944204 3.660684 0.452697
O  2.231974 -3.260492 -0.686341
C  -3.572547 -0.132643 1.240859
C  -2.62565 -0.816173 0.255881
C  -2.022495 2.429532 0.74979
C  -4.647431 2.537215 2.370697
C  -4.724265 2.016869 -0.666626
C  -2.450322 -2.315411 0.514635
C  -1.109576 2.325455 1.806371
C  -1.551291 2.990121 -0.431844
C  -1.425622 -2.91746 -0.404609
C  0.198302 2.746858 1.687894
C  -0.238814 3.427263 -0.576353
C  0.646833 3.30015 0.487348
C  -0.073665 -2.822735 -0.088077
C  -1.788626 -3.513083 -1.606145
C  0.902646 -3.289347 -0.95576
C  -0.824653 -4.003511 -2.474961
C  0.508979 -3.88352 -2.149757
C  2.47636 4.225078 -0.727729
C  3.946527 4.483242 -0.49578
C  2.798298 -2.203203 -0.035376
C  3.896339 -2.490819 0.764378
C  2.362084 -0.891899 -0.184165
C  4.558301 -1.4633 1.416585
C  3.026377 0.124712 0.486111
C  4.124026 -0.15231 1.287029
H  -3.205961 -0.281997 2.263023
H  -4.560387 -0.606147 1.21195
H  -1.644103 -0.335519 0.298033
H  -2.97721 -0.676046 -0.771436
H  -4.089707 2.427717 3.302159
H  -4.785336 3.605779 2.200637
H  -5.634126 2.099058 2.530461
H  -5.736983 1.620338 -0.576957
H  -4.814763 3.079356 -0.898184
H  -4.263515 1.529924 -1.527634
H  -2.15079 -2.46626 1.55574
H  -3.410731 -2.823893 0.395149
H  -1.42164 1.894252 2.751922
H  -2.213455 3.09308 -1.283635
H  0.890713 2.649203 2.514296
H  0.070534 3.85464 -1.520406
H  0.223211 -2.370208 0.850963
H  -2.835008 -3.601212 -1.870121
H  -1.101789 -4.474475 -3.408732
H  1.95647 5.159191 -0.972474
H  2.341022 3.542946 -1.57571
H  4.481141 3.557033 -0.285968
H  4.38862 4.931012 -1.385297
H  4.101349 5.167004 0.338031
H  4.226468 -3.516378 0.864286
H  1.513437 -0.655507 -0.812645
H  5.414785 -1.693844 2.03635
H  2.681049 1.143945 0.379865
H  4.634932 0.647941 1.805133
totalener: -1510.05091731 hartree
nucrepener: 2847.33882800 hartree
electener: -4357.38974531 hartree
oneelecener: -7723.82629191 hartree
twoeener: 3366.43654661 hartree
kineticenergy: 1503.94530965 hartree
xcener: -135.232703120877 hartree
chargesum: -0.0000000
charge: 0.436209 -0.193834 -0.295252 -0.290909 -0.263714 -0.112900 -0.157509 -0.385084 -0.409728 -0.088019 -0.059027 -0.099261 0.085582 -0.248108 -0.205463 0.310803 -0.245581 -0.188984 0.204458 -0.141067 0.166455 0.014719 -0.250274 0.313371 -0.243478 -0.248948 -0.053451 -0.036527 -0.221390 0.076057 0.076940 0.079109 0.082084 0.088423 0.096555 0.092327 0.099496 0.099949 0.092062 0.078334 0.075700 0.101571 0.112620 0.115053 0.103689 0.127853 0.110035 0.120294 0.098619 0.087717 0.083835 0.080258 0.087295 0.124685 0.129657 0.123579 0.142022 0.121093
qa: 0.4362 -0.1938 -0.2953 -0.2909 -0.2637 -0.1129 -0.1575 -0.3851 -0.4097 -0.0880 -0.0590 -0.0993 0.0856 -0.2481 -0.2055 0.3108 -0.2456 -0.1890 0.2045 -0.1411 0.1665 0.0147 -0.2503 0.3134 -0.2435 -0.2489 -0.0535 -0.0365 -0.2214 0.0761 0.0769 0.0791 0.0821 0.0884 0.0966 0.0923 0.0995 0.0999 0.0921 0.0783 0.0757 0.1016 0.1126 0.1151 0.1037 0.1279 0.1100 0.1203 0.0986 0.0877 0.0838 0.0803 0.0873 0.1247 0.1297 0.1236 0.1420 0.1211
va: 4.1785 1.1031 2.0966 2.1262 3.8383 3.8204 3.8271 3.9041 3.9124 3.8230 3.8758 3.9698 3.6641 4.0522 3.9503 3.7960 3.9516 3.9609 3.7420 3.9062 4.1004 3.8428 3.9835 3.7705 4.0555 3.9648 3.9002 3.8269 4.0303 1.0168 1.0206 1.0121 1.0089 1.0150 1.0117 1.0119 1.0141 1.0098 1.0108 1.0123 1.0134 0.9988 0.9975 1.0192 1.0204 1.0084 1.0106 1.0075 0.9880 0.9841 1.0051 1.0081 1.0057 1.0150 1.0108 0.9986 0.9805 1.0053
dispcorr: -0.029237783 hartree
energy: -1510.080155088135
dipole: -17.83669 17.35920 -0.47749 29.09321 -28.09605 0.99716 10.51404 -10.39915 0.11490
magnitude: 1.11154 au
magnitude: 2.82532 debye
