program: Orca
programVersion: 5.0.2
elementType: Si F O O C C C C C C C C C C C C C C C C C C C C C C C C C H H H H H H H H H H H H H H H H H H H H H H H H H H H H H
charge: 0
multiplicity: 1
keywords: wb97x-d3
keywords: def2-TZVPP
keywords: def2/J RIJCOSX
keywords: DEFGRID2
keywords: scfconv7
keywords: smallprint printgap noloewdin
keywords: NOSOSCF
formula: C25H29FO2Si
InChI: InChI=1/C25H29FO2Si/c1-4-27-21-13-15-23(16-14-21)29(2,3)18-8-9-20-12-17-24(26)25(19-20)28-22-10-6-5-7-11-22/h5-7,10-17,19H,4,8-9,18H2,1-3H3
58 atoms
Si -3.817496 1.18915 0.2838
F  1.746191 -2.538434 1.920857
O  1.998804 1.972681 1.711801
O  2.135757 -0.883139 -0.115543
C  -3.864307 -0.541047 -0.472123
C  -3.032247 -0.637656 -1.756674
C  -2.025787 1.477906 0.7597
C  -4.914792 1.252299 1.814491
C  -4.378435 2.482299 -0.967488
C  -2.312354 -1.98034 -1.925396
C  -1.425056 0.671309 1.724141
C  -1.213268 2.434098 0.145814
C  -1.22733 -2.171263 -0.900127
C  -0.091094 0.802995 2.079427
C  0.121442 2.579514 0.475544
C  0.695022 1.764679 1.450549
C  -0.043594 -1.44502 -1.012183
C  -1.388083 -3.01875 0.187659
C  0.968936 -1.574747 -0.07693
C  -0.390751 -3.141236 1.147389
C  0.7759 -2.426928 1.004727
C  2.641764 1.172348 2.685767
C  4.098304 1.569602 2.727865
C  2.671791 -0.523001 -1.321148
C  3.110276 0.784055 -1.466216
C  2.827375 -1.441776 -2.351862
C  3.707798 1.171947 -2.656557
C  3.417277 -1.036772 -3.538649
C  3.85848 0.269427 -3.698174
H  -3.457327 -1.211395 0.293032
H  -4.88696 -0.884479 -0.650945
H  -2.272962 0.151312 -1.791271
H  -3.676329 -0.463994 -2.621958
H  -5.955999 1.032226 1.57242
H  -4.596722 0.527937 2.566062
H  -4.885366 2.236693 2.28324
H  -5.423581 2.327933 -1.240761
H  -4.295658 3.494076 -0.567416
H  -3.795771 2.444279 -1.889354
H  -3.036479 -2.796388 -1.859049
H  -1.877715 -2.033069 -2.927341
H  -2.001937 -0.100248 2.222944
H  -1.6260 3.088044 -0.613982
H  0.3172 0.148049 2.836648
H  0.73242 3.327287 -0.014097
H  0.089153 -0.763706 -1.844231
H  -2.298242 -3.595555 0.292748
H  -0.510972 -3.801054 1.996441
H  2.548311 0.111551 2.435097
H  2.175817 1.325424 3.666735
H  4.619195 0.978638 3.480713
H  4.582031 1.38795 1.768261
H  4.218197 2.622169 2.982858
H  2.98299 1.48343 -0.650698
H  2.4926 -2.463964 -2.229717
H  4.048976 2.192563 -2.769352
H  3.537701 -1.752283 -4.341384
H  4.319271 0.578873 -4.626473
totalener: -1510.04972290 hartree
nucrepener: 3046.55500959 hartree
electener: -4556.60473249 hartree
oneelecener: -8122.85200647 hartree
twoeener: 3566.24727398 hartree
kineticenergy: 1503.95659986 hartree
xcener: -135.240055030776 hartree
chargesum: -0.0000000
charge: 0.422148 -0.205228 -0.298664 -0.296989 -0.244749 -0.109903 -0.089131 -0.391312 -0.409755 -0.134562 -0.161409 -0.062955 0.102207 -0.206094 -0.241558 0.317292 -0.189596 -0.205772 0.198469 -0.114847 0.136443 0.023366 -0.254300 0.267251 -0.214296 -0.163804 -0.111716 -0.116711 -0.137203 0.061977 0.086557 0.059395 0.088453 0.090691 0.087346 0.096617 0.098981 0.101677 0.093111 0.078392 0.092712 0.094813 0.112774 0.112028 0.112181 0.119781 0.116380 0.119851 0.086328 0.095263 0.081628 0.083621 0.086044 0.130630 0.130561 0.125446 0.125379 0.124765
qa: 0.4221 -0.2052 -0.2987 -0.2970 -0.2447 -0.1099 -0.0891 -0.3913 -0.4098 -0.1346 -0.1614 -0.0630 0.1022 -0.2061 -0.2416 0.3173 -0.1896 -0.2058 0.1985 -0.1148 0.1364 0.0234 -0.2543 0.2673 -0.2143 -0.1638 -0.1117 -0.1167 -0.1372 0.0620 0.0866 0.0594 0.0885 0.0907 0.0873 0.0966 0.0990 0.1017 0.0931 0.0784 0.0927 0.0948 0.1128 0.1120 0.1122 0.1198 0.1164 0.1199 0.0863 0.0953 0.0816 0.0836 0.0860 0.1306 0.1306 0.1254 0.1254 0.1248
va: 4.1961 1.0844 2.0907 2.0683 3.8244 3.8697 3.7617 3.9010 3.9136 3.9016 3.9973 3.8707 3.6319 3.9026 4.0369 3.7778 3.8877 3.9315 3.6269 3.9179 4.0501 3.8263 3.9780 3.7947 3.9758 3.9831 3.9691 3.9520 3.9576 1.0270 1.0156 1.0094 1.0087 1.0131 1.0147 1.0121 1.0136 1.0100 1.0101 1.0088 1.0059 1.0033 0.9948 1.0146 1.0171 1.0141 1.0085 1.0070 0.9975 0.9907 1.0085 1.0050 1.0059 1.0266 1.0039 1.0010 0.9997 1.0001
dispcorr: -0.036102160 hartree
energy: -1510.085825063444
dipole: -18.49261 18.18264 -0.30997 11.67326 -11.90364 -0.23038 -3.64278 3.20311 -0.43967
magnitude: 0.58521 au
magnitude: 1.48748 debye
