program: Orca
programVersion: 5.0.2
elementType: Si F O O C C C C C C C C C C C C C C C C C C C C C C C C C H H H H H H H H H H H H H H H H H H H H H H H H H H H H H
charge: 0
multiplicity: 1
keywords: wb97x-d3
keywords: def2-TZVPP
keywords: def2/J RIJCOSX
keywords: DEFGRID2
keywords: scfconv7
keywords: smallprint printgap noloewdin
keywords: NOSOSCF
formula: C25H29FO2Si
InChI: InChI=1/C25H29FO2Si/c1-4-27-21-13-15-23(16-14-21)29(2,3)18-8-9-20-12-17-24(26)25(19-20)28-22-10-6-5-7-11-22/h5-7,10-17,19H,4,8-9,18H2,1-3H3
58 atoms
Si -3.569376 1.253046 0.834425
F  1.862803 -3.755657 0.394052
O  2.160819 3.098417 0.252733
O  1.597878 -1.834595 -1.55736
C  -3.649363 -0.589671 0.402617
C  -3.577572 -0.872502 -1.097729
C  -1.800613 1.854131 0.622739
C  -4.103516 1.503552 2.624754
C  -4.706844 2.220354 -0.316954
C  -3.255144 -2.330395 -1.438324
C  -1.201415 1.946447 -0.632571
C  -1.00411 2.203453 1.718461
C  -1.890639 -2.741983 -0.957804
C  0.117967 2.341204 -0.804816
C  0.306049 2.6176 1.572302
C  0.884265 2.687668 0.304863
C  -0.75452 -2.105671 -1.454397
C  -1.72621 -3.719206 0.014306
C  0.510106 -2.437005 -1.005227
C  -0.463231 -4.065892 0.476502
C  0.642952 -3.428537 -0.037405
C  2.863419 3.005523 -0.970869
C  4.26876 3.510537 -0.745286
C  2.465329 -1.161741 -0.742181
C  3.789151 -1.102498 -1.155389
C  2.059744 -0.529693 0.425066
C  4.716579 -0.427053 -0.378862
C  3.002491 0.132892 1.196534
C  4.331866 0.181286 0.807641
H  -2.814861 -1.078166 0.916916
H  -4.559523 -1.035942 0.817306
H  -2.820227 -0.240575 -1.571111
H  -4.524536 -0.596935 -1.56902
H  -4.020973 2.547645 2.930338
H  -5.144859 1.207396 2.761423
H  -3.507754 0.907885 3.318196
H  -4.708223 3.282354 -0.068211
H  -4.398442 2.135523 -1.360454
H  -5.736959 1.864639 -0.254876
H  -4.011685 -2.98497 -0.998255
H  -3.320138 -2.469252 -2.521556
H  -1.770943 1.710537 -1.524629
H  -1.413533 2.158215 2.72095
H  0.527771 2.378704 -1.804629
H  0.897839 2.895068 2.435653
H  -0.840005 -1.332039 -2.208181
H  -2.594125 -4.222064 0.421321
H  -0.334039 -4.831686 1.229678
H  2.371261 3.609071 -1.743342
H  2.880212 1.965586 -1.317811
H  4.83627 3.441618 -1.673095
H  4.269718 4.552307 -0.425335
H  4.783131 2.91504 0.007073
H  4.084964 -1.597013 -2.071245
H  1.021485 -0.5392 0.732375
H  5.750209 -0.390865 -0.697361
H  2.684218 0.622843 2.106636
H  5.060569 0.694872 1.42023
totalener: -1510.04910453 hartree
nucrepener: 2999.33020176 hartree
electener: -4509.37930630 hartree
oneelecener: -8028.15676134 hartree
twoeener: 3518.77745504 hartree
kineticenergy: 1503.96573873 hartree
xcener: -135.241347135591 hartree
chargesum: 0.0000000
charge: 0.438319 -0.195383 -0.282292 -0.303809 -0.223994 -0.123101 -0.109434 -0.438511 -0.388326 -0.128757 -0.159026 -0.037491 0.016524 -0.205648 -0.279347 0.317767 -0.199786 -0.133305 0.130149 -0.148575 0.260777 0.018825 -0.268928 0.228797 -0.181267 -0.091498 -0.108142 -0.131430 -0.184305 0.085021 0.077244 0.051249 0.088740 0.099602 0.096496 0.092450 0.103651 0.090812 0.096810 0.071155 0.098852 0.116547 0.111809 0.100824 0.114513 0.107067 0.108080 0.121747 0.097489 0.093114 0.080329 0.092147 0.089683 0.120957 0.127909 0.122689 0.122983 0.131224
qa: 0.4383 -0.1954 -0.2823 -0.3038 -0.2240 -0.1231 -0.1094 -0.4385 -0.3883 -0.1288 -0.1590 -0.0375 0.0165 -0.2056 -0.2793 0.3178 -0.1998 -0.1333 0.1301 -0.1486 0.2608 0.0188 -0.2689 0.2288 -0.1813 -0.0915 -0.1081 -0.1314 -0.1843 0.0850 0.0772 0.0512 0.0887 0.0996 0.0965 0.0925 0.1037 0.0908 0.0968 0.0712 0.0989 0.1165 0.1118 0.1008 0.1145 0.1071 0.1081 0.1217 0.0975 0.0931 0.0803 0.0921 0.0897 0.1210 0.1279 0.1227 0.1230 0.1312
va: 4.1664 1.0982 2.0981 2.0979 3.8031 3.8773 3.8190 3.9315 3.8867 3.8984 3.9748 3.8475 3.6970 3.9149 4.0431 3.7846 3.9642 3.9097 3.8296 3.9473 3.9976 3.8155 3.9727 3.8091 3.9987 3.8253 3.9200 3.8971 3.9103 1.0177 1.0130 1.0150 1.0094 1.0116 1.0168 1.0123 1.0134 1.0110 1.0090 1.0124 1.0036 0.9864 0.9952 1.0217 1.0196 1.0227 1.0114 1.0074 0.9924 0.9835 1.0073 1.0077 1.0092 1.0149 1.0070 1.0000 1.0076 0.9973
dispcorr: -0.035170889 hartree
energy: -1510.084275423181
dipole: -17.72875 17.29937 -0.42938 20.80622 -20.62864 0.17758 0.14344 -0.36296 -0.21952
magnitude: 0.51390 au
magnitude: 1.30622 debye
