program: Orca
programVersion: 5.0.2
elementType: Si F O O C C C C C C C C C C C C C C C C C C C C C C C C C H H H H H H H H H H H H H H H H H H H H H H H H H H H H H
charge: 0
multiplicity: 1
keywords: wb97x-d3
keywords: def2-TZVPP
keywords: def2/J RIJCOSX
keywords: DEFGRID2
keywords: scfconv7
keywords: smallprint printgap noloewdin
keywords: NOSOSCF
formula: C25H29FO2Si
InChI: InChI=1/C25H29FO2Si/c1-4-27-21-13-15-23(16-14-21)29(2,3)18-8-9-20-12-17-24(26)25(19-20)28-22-10-6-5-7-11-22/h5-7,10-17,19H,4,8-9,18H2,1-3H3
58 atoms
Si -3.598192 1.287702 0.737727
F  1.805519 -3.846422 0.267073
O  2.182582 3.048557 0.500025
O  1.666545 -1.810743 -1.572978
C  -3.662904 -0.532584 0.21457
C  -3.518491 -0.747385 -1.291773
C  -1.816675 1.877498 0.635196
C  -4.212394 1.458832 2.511604
C  -4.679033 2.318981 -0.412531
C  -3.200376 -2.193049 -1.684648
C  -1.062219 2.152821 1.780756
C  -1.160936 2.01936 -0.58645
C  -1.866438 -2.655426 -1.164953
C  0.261116 2.544511 1.712053
C  0.172501 2.392221 -0.681716
C  0.896205 2.665376 0.475983
C  -0.695888 -2.021839 -1.578703
C  -1.764521 -3.688163 -0.24288
C  0.541229 -2.412442 -1.100818
C  -0.530017 -4.094027 0.247351
C  0.611477 -3.459651 -0.187156
C  2.9357 2.99548 -0.696512
C  4.338151 3.464857 -0.391871
C  2.498462 -1.184965 -0.686311
C  2.03688 -0.589259 0.47911
C  3.844347 -1.134504 -1.022096
C  2.944214 0.0277 1.327235
C  4.736217 -0.504389 -0.169443
C  4.293976 0.067028 1.015426
H  -2.855484 -1.048069 0.745311
H  -4.592591 -0.994519 0.562989
H  -2.730528 -0.106516 -1.698078
H  -4.437001 -0.436614 -1.796301
H  -4.132447 2.485463 2.872119
H  -5.262364 1.170833 2.585039
H  -3.657386 0.821508 3.201916
H  -4.333139 2.276719 -1.446756
H  -5.714113 1.972442 -0.404191
H  -4.679924 3.36874 -0.116607
H  -3.987053 -2.854709 -1.313242
H  -3.2166 -2.279315 -2.775208
H  -1.516215 2.065473 2.761072
H  -1.695991 1.841406 -1.512638
H  0.820632 2.763877 2.612857
H  0.626157 2.469802 -1.659973
H  -0.731842 -1.206556 -2.291428
H  -2.660004 -4.19052 0.099978
H  -0.450174 -4.904306 0.959664
H  2.487276 3.640655 -1.461713
H  2.949293 1.971027 -1.086654
H  4.342938 4.492443 -0.029107
H  4.810775 2.829956 0.355564
H  4.942828 3.423519 -1.297551
H  0.982689 -0.5924 0.726211
H  4.183987 -1.600152 -1.937824
H  2.582557 0.489255 2.235881
H  5.786839 -0.474493 -0.42719
H  4.99472 0.545048 1.686654
totalener: -1510.04929639 hartree
nucrepener: 2995.16858930 hartree
electener: -4505.21788569 hartree
oneelecener: -8019.82129093 hartree
twoeener: 3514.60340524 hartree
kineticenergy: 1503.96332128 hartree
xcener: -135.240553753437 hartree
chargesum: -0.0000000
charge: 0.436263 -0.195506 -0.282449 -0.303676 -0.223387 -0.123438 -0.107408 -0.437640 -0.387877 -0.128856 -0.039252 -0.159673 0.014660 -0.276055 -0.203134 0.311519 -0.198603 -0.130972 0.128709 -0.150041 0.262024 0.015983 -0.268039 0.226012 -0.093321 -0.176888 -0.131890 -0.108126 -0.184105 0.084909 0.077170 0.051738 0.088342 0.099600 0.096385 0.092870 0.090770 0.096850 0.103738 0.070833 0.099371 0.111876 0.116691 0.114658 0.101074 0.106984 0.108464 0.121681 0.097458 0.095373 0.091954 0.089686 0.080589 0.127724 0.120885 0.123166 0.122608 0.131721
qa: 0.4363 -0.1955 -0.2824 -0.3037 -0.2234 -0.1234 -0.1074 -0.4376 -0.3879 -0.1289 -0.0393 -0.1597 0.0147 -0.2761 -0.2031 0.3115 -0.1986 -0.1310 0.1287 -0.1500 0.2620 0.0160 -0.2680 0.2260 -0.0933 -0.1769 -0.1319 -0.1081 -0.1841 0.0849 0.0772 0.0517 0.0883 0.0996 0.0964 0.0929 0.0908 0.0969 0.1037 0.0708 0.0994 0.1119 0.1167 0.1147 0.1011 0.1070 0.1085 0.1217 0.0975 0.0954 0.0920 0.0897 0.0806 0.1277 0.1209 0.1232 0.1226 0.1317
va: 4.1684 1.0985 2.0970 2.0989 3.8030 3.8768 3.8171 3.9314 3.8865 3.8960 3.8509 3.9777 3.6939 4.0418 3.9143 3.7926 3.9626 3.9095 3.8303 3.9482 4.0013 3.8161 3.9722 3.8113 3.8238 4.0003 3.8946 3.9211 3.9121 1.0177 1.0129 1.0154 1.0092 1.0115 1.0167 1.0121 1.0112 1.0089 1.0134 1.0124 1.0031 0.9952 0.9864 1.0195 1.0218 1.0227 1.0113 1.0075 0.9923 0.9831 1.0076 1.0093 1.0074 1.0070 1.0148 1.0077 0.9999 0.9973
dispcorr: -0.035023503 hartree
energy: -1510.084319896841
dipole: -17.54824 17.12210 -0.42614 21.22834 -21.02910 0.19924 0.42854 -0.65805 -0.22950
magnitude: 0.52341 au
magnitude: 1.33041 debye
