program: Orca
programVersion: 5.0.2
elementType: Si F O O C C C C C C C C C C C C C C C C C C C C C C C C C H H H H H H H H H H H H H H H H H H H H H H H H H H H H H
charge: 0
multiplicity: 1
keywords: wb97x-d3
keywords: def2-TZVPP
keywords: def2/J RIJCOSX
keywords: DEFGRID2
keywords: scfconv7
keywords: smallprint printgap noloewdin
keywords: NOSOSCF
formula: C25H29FO2Si
InChI: InChI=1/C25H29FO2Si/c1-4-27-21-13-15-23(16-14-21)29(2,3)18-8-9-20-12-17-24(26)25(19-20)28-22-10-6-5-7-11-22/h5-7,10-17,19H,4,8-9,18H2,1-3H3
58 atoms
Si -2.80078 1.397497 0.315987
F  1.061325 -5.085144 0.701204
O  2.387761 3.901924 2.14519
O  1.706761 -3.180493 -1.074196
C  -2.329948 -0.145529 -0.666435
C  -3.480296 -1.088953 -1.007737
C  -1.211917 2.231271 0.873645
C  -3.813578 0.896415 1.826385
C  -3.801747 2.575459 -0.762204
C  -3.062133 -2.282347 -1.881535
C  -0.734934 3.400072 0.289974
C  -0.425852 1.670833 1.888635
C  -1.969367 -3.095917 -1.248728
C  0.461058 3.993508 0.679201
C  0.763825 2.240471 2.295107
C  1.220247 3.414462 1.691268
C  -0.637002 -2.797277 -1.511178
C  -2.25605 -4.100669 -0.331606
C  0.394642 -3.447177 -0.849022
C  -1.235791 -4.78255 0.314554
C  0.077968 -4.445854 0.063196
C  2.940241 5.047705 1.533354
C  4.278358 5.32293 2.178764
C  2.102253 -1.886475 -1.274984
C  3.092914 -1.668294 -2.221215
C  1.579973 -0.824288 -0.546276
C  3.559183 -0.380207 -2.437791
C  2.040085 0.460925 -0.786255
C  3.03018 0.689303 -1.73081
H  -1.815563 0.175809 -1.579683
H  -1.573223 -0.683852 -0.08782
H  -4.274626 -0.548043 -1.531742
H  -3.930641 -1.467523 -0.085248
H  -4.040181 1.759313 2.453873
H  -4.763237 0.442337 1.538387
H  -3.286954 0.171066 2.449187
H  -4.062791 3.490184 -0.227699
H  -3.26161 2.862291 -1.666017
H  -4.736057 2.111007 -1.082308
H  -3.935386 -2.911117 -2.072431
H  -2.729293 -1.910077 -2.85405
H  -1.302139 3.881582 -0.498154
H  -0.746552 0.759017 2.381455
H  0.775693 4.904953 0.189317
H  1.356869 1.787126 3.078974
H  -0.395699 -2.023314 -2.229838
H  -3.285638 -4.356967 -0.114651
H  -1.453163 -5.5685 1.02558
H  2.273045 5.90944 1.657178
H  3.066067 4.884339 0.4559
H  4.728805 6.209634 1.733348
H  4.172486 5.500751 3.248363
H  4.964001 4.488584 2.035687
H  3.494033 -2.50578 -2.776705
H  0.817838 -0.988346 0.20433
H  4.335259 -0.214623 -3.173559
H  1.620474 1.283049 -0.221638
H  3.388301 1.694062 -1.909951
totalener: -1510.04938512 hartree
nucrepener: 2883.70015044 hartree
electener: -4393.74953556 hartree
oneelecener: -7796.59990965 hartree
twoeener: 3402.85037408 hartree
kineticenergy: 1503.94697600 hartree
xcener: -135.236348240453 hartree
chargesum: 0.0000000
charge: 0.459968 -0.193292 -0.279027 -0.294359 -0.203191 -0.137882 -0.106503 -0.402038 -0.421882 -0.138237 -0.121809 -0.142428 0.105050 -0.196924 -0.218699 0.303424 -0.250006 -0.186156 0.206968 -0.144056 0.171202 0.044048 -0.256725 0.290027 -0.231994 -0.224493 -0.058732 0.017241 -0.220340 0.083207 0.055401 0.075247 0.076015 0.106271 0.095024 0.095159 0.105423 0.092381 0.094890 0.086556 0.082035 0.108034 0.108772 0.102836 0.114392 0.126340 0.111034 0.120230 0.079633 0.075868 0.077289 0.087340 0.087870 0.124260 0.138118 0.122836 0.081244 0.117141
qa: 0.4600 -0.1933 -0.2790 -0.2944 -0.2032 -0.1379 -0.1065 -0.4020 -0.4219 -0.1382 -0.1218 -0.1424 0.1051 -0.1969 -0.2187 0.3034 -0.2500 -0.1862 0.2070 -0.1441 0.1712 0.0440 -0.2567 0.2900 -0.2320 -0.2245 -0.0587 0.0172 -0.2203 0.0832 0.0554 0.0752 0.0760 0.1063 0.0950 0.0952 0.1054 0.0924 0.0949 0.0866 0.0820 0.1080 0.1088 0.1028 0.1144 0.1263 0.1110 0.1202 0.0796 0.0759 0.0773 0.0873 0.0879 0.1243 0.1381 0.1228 0.0812 0.1171
va: 4.1531 1.1042 2.1253 2.1275 3.7937 3.8941 3.7814 3.8944 3.9199 3.8980 3.9867 3.8913 3.5906 3.9050 4.0160 3.8321 3.9289 3.9611 3.7213 3.9118 4.1083 3.8500 3.9830 3.7945 4.0545 3.9342 3.8996 3.8060 4.0519 1.0165 1.0344 1.0119 1.0032 1.0118 1.0092 1.0111 1.0101 1.0110 1.0149 1.0099 1.0110 1.0001 1.0009 1.0211 1.0203 1.0082 1.0093 1.0073 0.9848 0.9855 1.0070 1.0058 1.0060 1.0140 0.9977 0.9982 1.0227 1.0036
dispcorr: -0.031184039 hartree
energy: -1510.080569160503
dipole: -14.41467 13.91631 -0.49836 32.26435 -30.92277 1.34158 -0.08694 -0.30765 -0.39459
magnitude: 1.48456 au
magnitude: 3.77344 debye
