program: Orca
programVersion: 5.0.2
elementType: Si F O O C C C C C C C C C C C C C C C C C C C C C C C C C H H H H H H H H H H H H H H H H H H H H H H H H H H H H H
charge: 0
multiplicity: 1
keywords: wb97x-d3
keywords: def2-TZVPP
keywords: def2/J RIJCOSX
keywords: DEFGRID2
keywords: scfconv7
keywords: smallprint printgap noloewdin
keywords: NOSOSCF
formula: C25H29FO2Si
InChI: InChI=1/C25H29FO2Si/c1-4-27-21-13-15-23(16-14-21)29(2,3)18-8-9-20-12-17-24(26)25(19-20)28-22-10-6-5-7-11-22/h5-7,10-17,19H,4,8-9,18H2,1-3H3
58 atoms
Si -2.803846 1.412543 0.278726
F  1.067567 -5.070424 0.716033
O  2.391324 3.837389 2.191434
O  1.707066 -3.164059 -1.060322
C  -2.332476 -0.140146 -0.68857
C  -3.48212 -1.087646 -1.020724
C  -1.214626 2.227159 0.862543
C  -3.853301 0.931531 1.770067
C  -3.76847 2.597739 -0.824158
C  -3.0632 -2.290635 -1.880923
C  -0.70676 3.384834 0.283015
C  -0.456884 1.656746 1.893321
C  -1.969047 -3.096537 -1.240758
C  0.491892 3.959275 0.692504
C  0.734724 2.207221 2.319614
C  1.222458 3.37062 1.71995
C  -0.637435 -2.793212 -1.502046
C  -2.252874 -4.099541 -0.320988
C  0.395979 -3.437156 -0.837119
C  -1.230459 -4.775965 0.327768
C  0.082269 -4.435444 0.076681
C  2.983075 4.962015 1.576965
C  4.320474 5.204921 2.236582
C  2.090004 -1.868759 -1.277947
C  3.055764 -1.647675 -2.248569
C  1.576636 -0.807545 -0.541682
C  3.506574 -0.356932 -2.482139
C  2.020992 0.479927 -0.797826
C  2.986315 0.711432 -1.767177
H  -1.817483 0.17187 -1.604853
H  -1.575931 -0.672116 -0.10421
H  -4.275733 -0.552786 -1.552072
H  -3.933864 -1.455806 -0.094794
H  -3.347424 0.205153 2.408485
H  -4.085059 1.800705 2.386968
H  -4.800841 0.484948 1.463688
H  -4.701866 2.142478 -1.160126
H  -4.029253 3.51784 -0.29891
H  -3.20835 2.874411 -1.719025
H  -3.936043 -2.922285 -2.063933
H  -2.731576 -1.929273 -2.858027
H  -1.251754 3.873548 -0.516216
H  -0.803092 0.753469 2.384536
H  0.831666 4.863091 0.205275
H  1.305717 1.746913 3.115701
H  -0.398543 -2.02022 -2.222519
H  -3.281637 -4.359313 -0.104402
H  -1.445512 -5.560838 1.040683
H  2.338865 5.843003 1.685617
H  3.117327 4.786149 0.502537
H  4.800976 6.075204 1.790167
H  4.206934 5.393806 3.303479
H  4.983869 4.350546 2.10778
H  3.449559 -2.484676 -2.809926
H  0.83341 -0.974342 0.227089
H  4.263091 -0.188504 -3.237326
H  1.608312 1.301567 -0.227581
H  3.331994 1.71817 -1.95939
totalener: -1510.04942431 hartree
nucrepener: 2886.93676270 hartree
electener: -4396.98618700 hartree
oneelecener: -7803.07856065 hartree
twoeener: 3406.09237365 hartree
kineticenergy: 1503.95052883 hartree
xcener: -135.237071900321 hartree
chargesum: -0.0000000
charge: 0.459021 -0.193407 -0.278927 -0.294568 -0.202798 -0.137168 -0.109865 -0.402611 -0.420764 -0.139150 -0.120015 -0.141665 0.104943 -0.197545 -0.215308 0.301525 -0.246738 -0.186265 0.203508 -0.143908 0.171649 0.043782 -0.256564 0.286769 -0.230022 -0.224231 -0.059497 0.022077 -0.220262 0.082851 0.055813 0.075089 0.076105 0.095399 0.106386 0.095215 0.094854 0.105217 0.092298 0.086214 0.082399 0.107584 0.108919 0.102425 0.114376 0.126285 0.110875 0.120122 0.079756 0.075907 0.077286 0.087377 0.088030 0.124485 0.137566 0.122787 0.079373 0.117015
qa: 0.4590 -0.1934 -0.2789 -0.2946 -0.2028 -0.1372 -0.1099 -0.4026 -0.4208 -0.1392 -0.1200 -0.1417 0.1049 -0.1975 -0.2153 0.3015 -0.2467 -0.1863 0.2035 -0.1439 0.1716 0.0438 -0.2566 0.2868 -0.2300 -0.2242 -0.0595 0.0221 -0.2203 0.0829 0.0558 0.0751 0.0761 0.0954 0.1064 0.0952 0.0949 0.1052 0.0923 0.0862 0.0824 0.1076 0.1089 0.1024 0.1144 0.1263 0.1109 0.1201 0.0798 0.0759 0.0773 0.0874 0.0880 0.1245 0.1376 0.1228 0.0794 0.1170
va: 4.1535 1.1041 2.1250 2.1265 3.7932 3.8938 3.7838 3.8946 3.9196 3.8987 3.9815 3.8935 3.5920 3.9004 4.0187 3.8322 3.9241 3.9609 3.7245 3.9117 4.1075 3.8500 3.9828 3.7971 4.0545 3.9382 3.8997 3.8015 4.0505 1.0165 1.0338 1.0117 1.0031 1.0111 1.0120 1.0090 1.0149 1.0101 1.0112 1.0100 1.0107 1.0001 1.0007 1.0212 1.0202 1.0081 1.0093 1.0073 0.9846 0.9856 1.0070 1.0057 1.0060 1.0138 0.9982 0.9983 1.0214 1.0037
dispcorr: -0.031284447 hartree
energy: -1510.080708755406
dipole: -14.32077 13.83842 -0.48235 32.05383 -30.72050 1.33333 -0.29136 -0.10947 -0.40083
magnitude: 1.47347 au
magnitude: 3.74526 debye
