program: Orca
programVersion: 5.0.2
elementType: Si F O O C C C C C C C C C C C C C C C C C C C C C C C C C H H H H H H H H H H H H H H H H H H H H H H H H H H H H H
charge: 0
multiplicity: 1
keywords: wb97x-d3
keywords: def2-TZVPP
keywords: def2/J RIJCOSX
keywords: DEFGRID2
keywords: scfconv7
keywords: smallprint printgap noloewdin
keywords: NOSOSCF
formula: C25H29FO2Si
InChI: InChI=1/C25H29FO2Si/c1-4-27-21-13-15-23(16-14-21)29(2,3)18-8-9-20-12-17-24(26)25(19-20)28-22-10-6-5-7-11-22/h5-7,10-17,19H,4,8-9,18H2,1-3H3
58 atoms
Si -3.661501 1.725911 0.056937
F  1.917374 -4.643936 -0.211637
O  2.229585 2.371004 1.250068
O  2.11321 -1.965072 -0.033009
C  -4.251824 0.09672 0.851094
C  -3.193551 -1.003785 0.945972
C  -1.829664 1.942757 0.412506
C  -4.616548 3.148836 0.844807
C  -3.965867 1.757071 -1.804631
C  -2.748534 -1.523714 -0.420701
C  -0.845465 1.951883 -0.580968
C  -1.388687 2.069302 1.727913
C  -1.520468 -2.385688 -0.351797
C  0.498953 2.084449 -0.284247
C  -0.047134 2.207196 2.054144
C  0.909516 2.223482 1.042105
C  -0.275294 -1.780157 -0.217711
C  -1.582766 -3.772963 -0.403934
C  0.885329 -2.534068 -0.171786
C  -0.428729 -4.541334 -0.339404
C  0.79768 -3.917761 -0.239078
C  2.711704 2.481126 2.571272
C  4.21559 2.615481 2.512354
C  2.515237 -1.021261 -0.93094
C  2.029119 -0.951858 -2.231222
C  3.479869 -0.124257 -0.495169
C  2.514431 0.026021 -3.086295
C  3.958296 0.843476 -1.361348
C  3.477203 0.928863 -2.659991
H  -4.614645 0.331086 1.85709
H  -5.130337 -0.268827 0.307676
H  -3.567302 -1.844265 1.538259
H  -2.319972 -0.625258 1.482242
H  -4.335183 4.105746 0.403382
H  -5.694034 3.030337 0.71656
H  -4.424604 3.218499 1.916916
H  -3.441417 0.965253 -2.340838
H  -5.029211 1.637566 -2.020323
H  -3.654285 2.708886 -2.238405
H  -3.570652 -2.071075 -0.889765
H  -2.537207 -0.678163 -1.080571
H  -1.126935 1.850305 -1.622996
H  -2.105594 2.061472 2.54244
H  1.243653 2.078263 -1.070647
H  0.230835 2.303181 3.094764
H  -0.203024 -0.698828 -0.161952
H  -2.541869 -4.265619 -0.503589
H  -0.474261 -5.621196 -0.386223
H  2.432747 1.59741 3.158091
H  2.274861 3.355313 3.069449
H  4.674602 1.740263 2.05315
H  4.512358 3.496598 1.944489
H  4.61831 2.713335 3.51994
H  1.282342 -1.651443 -2.581981
H  3.844497 -0.189089 0.520831
H  2.135031 0.074411 -4.098687
H  4.702345 1.545886 -1.010762
H  3.850466 1.688571 -3.33313
totalener: -1510.04769085 hartree
nucrepener: 2981.19788050 hartree
electener: -4491.24557134 hartree
oneelecener: -7991.82866223 hartree
twoeener: 3500.58309089 hartree
kineticenergy: 1503.96492174 hartree
xcener: -135.241710782616 hartree
chargesum: -0.0000000
charge: 0.416144 -0.193373 -0.276464 -0.296970 -0.272151 -0.102690 -0.076853 -0.409438 -0.403496 -0.117004 -0.082922 -0.173497 0.014523 -0.244179 -0.196192 0.328606 -0.119572 -0.128702 0.121652 -0.172516 0.210316 0.027386 -0.265869 0.286330 -0.162778 -0.215882 -0.126633 -0.057473 -0.169116 0.094139 0.076618 0.088129 0.080312 0.095308 0.092092 0.086540 0.093815 0.099274 0.103450 0.083845 0.070649 0.114875 0.105222 0.133266 0.105321 0.090109 0.108790 0.119223 0.085284 0.085416 0.078548 0.090079 0.086692 0.123811 0.110373 0.124589 0.111598 0.121443
qa: 0.4161 -0.1934 -0.2765 -0.2970 -0.2722 -0.1027 -0.0769 -0.4094 -0.4035 -0.1170 -0.0829 -0.1735 0.0145 -0.2442 -0.1962 0.3286 -0.1196 -0.1287 0.1217 -0.1725 0.2103 0.0274 -0.2659 0.2863 -0.1628 -0.2159 -0.1266 -0.0575 -0.1691 0.0941 0.0766 0.0881 0.0803 0.0953 0.0921 0.0865 0.0938 0.0993 0.1034 0.0838 0.0706 0.1149 0.1052 0.1333 0.1053 0.0901 0.1088 0.1192 0.0853 0.0854 0.0785 0.0901 0.0867 0.1238 0.1104 0.1246 0.1116 0.1214
va: 4.1410 1.1048 2.1258 2.1188 3.8431 3.8453 3.7335 3.9058 3.8924 3.7819 3.8107 4.0120 3.7282 3.9722 3.9527 3.8522 3.8764 3.9129 3.7625 3.9286 4.0719 3.8497 3.9846 3.8046 3.9093 3.9726 3.9306 3.8986 3.9551 1.0097 1.0165 1.0114 1.0151 1.0142 1.0130 1.0167 1.0141 1.0159 1.0092 1.0158 1.0261 0.9985 1.0001 1.0066 1.0167 1.0284 1.0108 1.0084 0.9837 0.9855 1.0038 1.0038 1.0099 1.0087 1.0162 1.0008 1.0028 1.0023
dispcorr: -0.034471535 hartree
energy: -1510.082162381711
dipole: -19.27027 18.70886 -0.56141 25.44376 -24.73536 0.70840 5.31464 -4.95420 0.36044
magnitude: 0.97310 au
magnitude: 2.47342 debye
