program: Orca
programVersion: 5.0.2
elementType: Si F O O C C C C C C C C C C C C C C C C C C C C C C C C C H H H H H H H H H H H H H H H H H H H H H H H H H H H H H
charge: 0
multiplicity: 1
keywords: wb97x-d3
keywords: def2-TZVPP
keywords: def2/J RIJCOSX
keywords: DEFGRID2
keywords: scfconv7
keywords: smallprint printgap noloewdin
keywords: NOSOSCF
formula: C25H29FO2Si
InChI: InChI=1/C25H29FO2Si/c1-4-27-21-13-15-23(16-14-21)29(2,3)18-8-9-20-12-17-24(26)25(19-20)28-22-10-6-5-7-11-22/h5-7,10-17,19H,4,8-9,18H2,1-3H3
58 atoms
Si -3.767257 1.082246 0.94858
F  1.536497 -4.311002 0.133092
O  1.756895 3.128374 -0.388954
O  1.441033 -1.718972 0.931357
C  -3.822547 -0.793047 0.650066
C  -3.938168 -1.258744 -0.803399
C  -2.066979 1.799846 0.59674
C  -4.197919 1.386022 2.759367
C  -5.038027 1.919177 -0.165638
C  -2.678951 -1.052883 -1.654723
C  -0.9932 1.553329 1.449757
C  -1.788406 2.53368 -0.56127
C  -1.528512 -1.911075 -1.20723
C  0.299413 1.975388 1.165768
C  -0.513975 2.971176 -0.863698
C  0.550186 2.685298 -0.00663
C  -0.521613 -1.397367 -0.397655
C  -1.469005 -3.255992 -1.560905
C  0.501901 -2.205667 0.068119
C  -0.440487 -4.072634 -1.11798
C  0.539404 -3.540582 -0.304636
C  2.891078 2.790225 0.387522
C  4.113205 3.347889 -0.301284
C  2.612532 -1.231793 0.441858
C  3.610036 -0.985385 1.380095
C  2.832612 -0.956916 -0.90184
C  4.827238 -0.470488 0.968818
C  4.05969 -0.440509 -1.296921
C  5.061892 -0.194714 -0.37228
H  -2.962377 -1.268993 1.132753
H  -4.695814 -1.160777 1.20045
H  -4.771755 -0.743683 -1.290066
H  -4.196156 -2.322461 -0.825798
H  -5.188326 0.998487 3.003741
H  -3.488969 0.901841 3.433466
H  -4.191935 2.451194 2.994474
H  -4.824827 1.771602 -1.226013
H  -6.037442 1.520442 0.016795
H  -5.078724 2.994864 0.012281
H  -2.920473 -1.288994 -2.694556
H  -2.380928 -0.001973 -1.641279
H  -1.146593 0.99081 2.364373
H  -2.584899 2.769657 -1.257833
H  1.093369 1.732744 1.858503
H  -0.322118 3.533515 -1.768622
H  -0.530029 -0.353922 -0.110376
H  -2.238828 -3.677662 -2.195736
H  -0.393413 -5.116366 -1.399122
H  2.977186 1.703261 0.486096
H  2.800133 3.209612 1.397024
H  4.060445 4.432487 -0.39382
H  5.002361 3.099003 0.277097
H  4.232409 2.919049 -1.2955
H  3.425572 -1.211526 2.422347
H  2.061878 -1.135977 -1.639531
H  5.601068 -0.289534 1.703499
H  4.226165 -0.229449 -2.345288
H  6.01486 0.204961 -0.691077
totalener: -1510.05026884 hartree
nucrepener: 2991.23596719 hartree
electener: -4501.28623603 hartree
oneelecener: -8011.76852733 hartree
twoeener: 3510.48229130 hartree
kineticenergy: 1503.95295810 hartree
xcener: -135.241246212158 hartree
chargesum: -0.0000000
charge: 0.449871 -0.195084 -0.283935 -0.291954 -0.259669 -0.150435 -0.134759 -0.411678 -0.418374 -0.116514 -0.123237 -0.079579 -0.001891 -0.232949 -0.234292 0.335783 -0.134553 -0.115402 0.107800 -0.198553 0.278443 0.098191 -0.273421 0.239876 -0.183801 -0.099274 -0.106920 -0.164153 -0.150410 0.083449 0.092086 0.080241 0.088338 0.092438 0.089360 0.098348 0.084984 0.104248 0.111317 0.092741 0.078855 0.105205 0.120044 0.103224 0.112455 0.088561 0.115259 0.120449 0.015833 0.093113 0.097658 0.079439 0.085055 0.119861 0.125668 0.122334 0.124750 0.125561
qa: 0.4499 -0.1951 -0.2839 -0.2920 -0.2597 -0.1504 -0.1348 -0.4117 -0.4184 -0.1165 -0.1232 -0.0796 -0.0019 -0.2329 -0.2343 0.3358 -0.1346 -0.1154 0.1078 -0.1986 0.2784 0.0982 -0.2734 0.2399 -0.1838 -0.0993 -0.1069 -0.1642 -0.1504 0.0834 0.0921 0.0802 0.0883 0.0924 0.0894 0.0983 0.0850 0.1042 0.1113 0.0927 0.0789 0.1052 0.1200 0.1032 0.1125 0.0886 0.1153 0.1204 0.0158 0.0931 0.0977 0.0794 0.0851 0.1199 0.1257 0.1223 0.1247 0.1256
va: 4.1677 1.1040 2.1275 2.1034 3.8213 3.9033 3.7123 3.9086 3.9101 3.8354 3.9255 3.8405 3.7283 3.8907 4.0835 3.7991 3.7798 3.9042 3.8021 3.9781 4.0505 3.8077 3.9782 3.7663 3.9453 3.8297 3.9171 3.9469 3.8771 1.0176 1.0089 1.0026 1.0033 1.0129 1.0150 1.0122 1.0092 1.0103 1.0110 1.0098 1.0257 1.0040 0.9933 1.0231 1.0193 1.0259 1.0060 1.0086 1.0000 0.9935 1.0096 1.0073 1.0071 1.0174 1.0120 1.0007 1.0026 1.0017
dispcorr: -0.035049438 hartree
energy: -1510.085318276831
dipole: -16.14016 16.01993 -0.12022 20.78787 -20.58024 0.20763 0.00545 -0.26491 -0.25946
magnitude: 0.35339 au
magnitude: 0.89824 debye
