program: Orca
programVersion: 5.0.2
elementType: Si F O O C C C C C C C C C C C C C C C C C C C C C C C C C H H H H H H H H H H H H H H H H H H H H H H H H H H H H H
charge: 0
multiplicity: 1
keywords: wb97x-d3
keywords: def2-TZVPP
keywords: def2/J RIJCOSX
keywords: DEFGRID2
keywords: scfconv7
keywords: smallprint printgap noloewdin
keywords: NOSOSCF
formula: C25H29FO2Si
InChI: InChI=1/C25H29FO2Si/c1-4-27-21-13-15-23(16-14-21)29(2,3)18-8-9-20-12-17-24(26)25(19-20)28-22-10-6-5-7-11-22/h5-7,10-17,19H,4,8-9,18H2,1-3H3
58 atoms
Si -3.092644 1.261934 1.18872
F  1.488984 -4.722265 -0.512457
O  2.185002 3.780983 -0.310515
O  1.88778 -2.146603 -1.303748
C  -3.165793 -0.384498 0.259679
C  -3.037072 -0.237954 -1.254237
C  -1.481085 2.101126 0.725932
C  -3.145643 0.918322 3.041531
C  -4.541281 2.367722 0.704565
C  -2.932502 -1.572551 -1.995979
C  -1.422192 3.395403 0.221747
C  -0.265083 1.417586 0.852569
C  -1.753309 -2.413293 -1.583238
C  -0.221252 3.998079 -0.1365
C  0.9398 1.989977 0.501804
C  0.970335 3.294436 0.004477
C  -0.46325 -1.88795 -1.594507
C  -1.916783 -3.736499 -1.189511
C  0.627766 -2.661906 -1.239416
C  -0.832399 -4.526001 -0.83297
C  0.434345 -3.983698 -0.861722
C  2.291304 5.100808 -0.796042
C  3.753339 5.39136 -1.043063
C  2.426945 -1.566827 -0.195572
C  1.841896 -1.611389 1.062964
C  3.631476 -0.89838 -0.384552
C  2.473007 -0.982248 2.12824
C  4.246813 -0.277014 0.687395
C  3.672084 -0.312342 1.95136
H  -2.357358 -1.019455 0.639546
H  -4.092721 -0.912525 0.510029
H  -2.167587 0.380956 -1.494043
H  -3.89904 0.306125 -1.650741
H  -4.061772 0.399987 3.330013
H  -2.306065 0.296224 3.355879
H  -3.095033 1.843798 3.616636
H  -5.49257 1.876438 0.915666
H  -4.536095 3.30697 1.259997
H  -4.532895 2.614811 -0.358265
H  -3.850186 -2.145569 -1.839251
H  -2.877099 -1.379223 -3.071925
H  -2.33254 3.969982 0.09435
H  -0.247304 0.402574 1.234774
H  -0.238233 5.008545 -0.521684
H  1.865572 1.438564 0.608247
H  -0.285413 -0.859538 -1.886776
H  -2.910197 -4.166149 -1.163715
H  -0.9667 -5.556091 -0.531011
H  1.880912 5.8127 -0.069112
H  1.718844 5.217831 -1.724583
H  3.871708 6.410057 -1.411773
H  4.334276 5.294895 -0.126442
H  4.170863 4.713477 -1.786688
H  0.902856 -2.124369 1.224501
H  4.073646 -0.869704 -1.371605
H  2.011545 -1.017138 3.106324
H  5.180898 0.246089 0.531063
H  4.152025 0.180374 2.785575
totalener: -1510.05082619 hartree
nucrepener: 2924.66181172 hartree
electener: -4434.71263790 hartree
oneelecener: -7878.81488781 hartree
twoeener: 3444.10224991 hartree
kineticenergy: 1503.95646731 hartree
xcener: -135.237630476039 hartree
chargesum: -0.0000000
charge: 0.424414 -0.192364 -0.278876 -0.298010 -0.253858 -0.112778 -0.115966 -0.376596 -0.427093 -0.127936 -0.105062 -0.096609 -0.006105 -0.216767 -0.150602 0.278632 -0.181928 -0.096017 0.141776 -0.170844 0.231078 0.044380 -0.258879 0.311136 -0.211116 -0.213125 -0.115391 -0.067899 -0.166968 0.075190 0.078114 0.079784 0.084152 0.090950 0.089598 0.095457 0.100124 0.098104 0.095922 0.069584 0.097596 0.109389 0.094981 0.100644 0.091814 0.118688 0.107471 0.122163 0.077307 0.076516 0.077788 0.085950 0.086293 0.122621 0.119721 0.122979 0.120684 0.119788
qa: 0.4244 -0.1924 -0.2789 -0.2980 -0.2539 -0.1128 -0.1160 -0.3766 -0.4271 -0.1279 -0.1051 -0.0966 -0.0061 -0.2168 -0.1506 0.2786 -0.1819 -0.0960 0.1418 -0.1708 0.2311 0.0444 -0.2589 0.3111 -0.2111 -0.2131 -0.1154 -0.0679 -0.1670 0.0752 0.0781 0.0798 0.0842 0.0909 0.0896 0.0955 0.1001 0.0981 0.0959 0.0696 0.0976 0.1094 0.0950 0.1006 0.0918 0.1187 0.1075 0.1222 0.0773 0.0765 0.0778 0.0860 0.0863 0.1226 0.1197 0.1230 0.1207 0.1198
va: 4.1823 1.1053 2.1280 2.1220 3.8362 3.8280 3.8058 3.8926 3.9167 3.8766 3.9603 3.8567 3.6984 3.9259 3.9913 3.9661 3.9615 3.9061 3.7736 3.9442 4.0513 3.8515 3.9841 3.7622 3.8707 4.0299 3.9191 3.9109 3.9430 1.0205 1.0210 1.0121 1.0089 1.0116 1.0134 1.0121 1.0127 1.0115 1.0086 1.0103 1.0017 0.9975 0.9971 1.0211 1.0191 1.0163 1.0097 1.0079 0.9853 0.9847 1.0071 1.0059 1.0056 1.0169 1.0168 1.0032 1.0001 1.0033
dispcorr: -0.031824133 hartree
energy: -1510.082650320172
dipole: -17.26085 16.61340 -0.64745 29.79395 -28.90633 0.88762 4.94048 -5.05771 -0.11723
magnitude: 1.10490 au
magnitude: 2.80843 debye
