program: Gaussian 09
title: 000071530
version: EM64L-G09RevD.01
frameworkgroup: C1[X(C14H23BrNO3)]
method: RPBEPBE
basis: SDD
operation: Freq
keyword: #p
keyword: freq=noraman
keyword: PBEPBE/SDD
title: #p freq=noraman PBEPBE/SDD
converged: YES YES NO NO
title: Mulliken charges:
elementType: Br O O O N C C C C C C C C C C C C C C H H H H H H H H H H H H H H H H H H H H H H H
charge: 0.136534 -0.292404 -0.256013 -0.178381 -0.116290 -0.343819 -0.295220 -0.296223 -0.405319 -0.576701 -0.011422 -0.698702 -0.708616 -0.693207 0.201178 0.183194 -0.320614 -0.172250 -0.082760 0.268554 0.305514 0.252456 0.263680 0.251499 0.265128 0.235990 0.218055 0.277131 0.262583 0.257360 0.256705 0.246542 0.247302 0.266694 0.271227 0.241251 0.265422 0.254482 0.228703 0.218256 0.288754 0.283749
chargesum: 1.00000
title: Mulliken charges with hydrogens summed into heavy atoms:
elementType: Br O O O N C C C C C C C C C C C C C C
charge: 0.136534 -0.292404 -0.256013 -0.178381 -0.116290 0.230249 0.220915 0.220404 0.048726 0.220373 0.245283 0.061835 0.069283 0.008234 0.201178 0.183194 -0.031860 0.111499 -0.082760
polarizability: 2.51535174e+02 -2.89071521e+01 1.75098425e+02 1.48226003e+01 1.55048591e+01 1.42641677e+02
1716.lowfreq: -17.0627 -4.1378 -0.0003 -0.0001 0.0003 5.8828 9.0729 23.8445 29.2823
frequency: -11.7246 22.9025 29.0233 48.5724 67.5530 74.2416 91.2455 111.2398 114.3839 142.1703 152.1603 158.9365 183.9769 203.3181 208.6661 228.4534 239.3800 250.3972 261.5372 280.8711 310.0812 314.9988 321.0989 356.1386 372.1397 412.7417 435.4534 455.0349 475.9744 484.2620 506.4434 530.5727 584.2953 606.1867 692.6982 703.9256 754.7033 768.5689 780.3366 804.3019 807.3659 816.4540 841.1568 886.1982 891.9492 901.3728 903.5517 920.9081 938.9461 977.3179 1008.2303 1017.3495 1023.1298 1042.3161 1056.0964 1067.8168 1074.1695 1091.7428 1100.1073 1122.0002 1134.6839 1143.5278 1160.9700 1182.0526 1187.8072 1204.7915 1242.4933 1261.1630 1276.5234 1289.4069 1311.0600 1330.7758 1333.2406 1337.3603 1358.2814 1362.0760 1368.7669 1389.3210 1399.5073 1408.5353 1421.3880 1438.6857 1442.7282 1451.0857 1461.5260 1462.4493 1466.5456 1474.5600 1477.1399 1478.3059 1482.4711 1487.7196 1490.7911 1494.1967 1497.2147 1527.1419 1640.7266 2995.3274 2999.0112 3006.6228 3007.1837 3018.0671 3026.8691 3027.8854 3032.7375 3051.9187 3060.8306 3087.5938 3093.5990 3094.5981 3095.7515 3097.8082 3111.8247 3117.6631 3121.9234 3127.2371 3142.2801 3156.9509 3238.9698 3256.4939
redmass: 3.6567 4.0578 5.3696 3.4204 6.8276 3.7469 2.3406 1.8029 4.8797 6.5673 2.2233 3.5323 2.0270 1.3205 1.7485 1.5821 3.3943 2.4933 2.0037 1.5746 4.2244 2.4441 2.7322 2.8870 2.6224 4.1596 3.7308 3.3272 2.7260 3.1883 4.6183 2.5207 6.5537 4.7606 3.1928 7.0499 5.6888 1.6655 1.7185 1.4878 1.5821 1.2570 1.7899 2.6169 7.3293 5.8033 1.3987 2.2832 1.9175 1.5586 1.7781 2.1171 2.0216 3.3016 3.5337 1.9269 1.7911 3.5739 1.9993 1.8375 2.2558 1.7925 1.9014 2.0100 1.5574 1.7842 1.3410 5.4099 1.2254 1.1394 1.1705 1.8246 1.3853 1.8613 1.2799 1.2618 1.3150 1.2859 1.2210 1.2060 1.1895 1.1701 6.7969 1.0877 1.0595 1.0635 1.0634 1.0622 1.0501 1.0490 1.0588 1.0527 1.0589 1.0785 1.0579 6.4386 10.6739 1.0543 1.0417 1.0377 1.0377 1.0861 1.0606 1.0578 1.0372 1.0619 1.1004 1.1044 1.1000 1.0994 1.0983 1.1008 1.1002 1.1026 1.1037 1.1051 1.1040 1.1044 1.0950 1.1049
irintensity: 0.6293 1.5788 0.7895 3.3743 2.6218 2.7283 4.3025 0.7636 2.3867 0.2052 0.4032 0.3083 5.0242 0.3211 2.0560 0.4483 1.7613 6.8004 2.5914 2.0841 0.4853 0.7773 1.1720 0.1596 0.8364 5.9930 2.4758 7.9208 2.6286 3.0019 1.0152 1.5905 2.7937 0.6003 1.8825 22.9370 9.6650 9.2868 19.2360 7.2725 24.1851 55.9358 4.0853 15.0971 32.4693 38.2748 1.9530 22.4730 15.2005 11.7296 85.2703 25.3039 31.3874 435.0904 90.8444 8.8328 0.0765 38.9374 6.1666 4.5898 11.3003 5.6856 16.2096 17.9683 15.3617 1.3805 3.0021 133.3618 8.2494 1.7109 4.8464 10.0866 0.1639 9.3829 12.8481 9.9705 1.2046 5.4346 19.8696 29.0026 24.4161 41.7721 392.1706 7.4204 9.3464 13.1194 9.9180 14.3045 22.0848 34.3022 5.4288 2.1033 71.2981 13.2110 23.9418 23.5872 450.8017 7.6886 22.7816 2.7637 4.3406 2.9509 5.6223 10.2264 9.9431 3.3563 13.5495 0.4567 4.2513 22.2161 6.9702 3.3973 15.9800 23.3653 22.7474 4.8399 7.6208 3.9461 0.0494 2.9622
temp: 298.150 k
press: 1.00000 atm
elementType: 35 8 8 8 7 6 6 6 6 6 6 6 6 6 6 6 6 6 6 1 1 1 1 1 1 1 1 1 1 1 1 1 1 1 1 1 1 1 1 1 1 1
symmnumber: 1
zpe: 926348.2 jmol-1
zpe.correction: 0.352827 hartree
zpe.thermalcorrener: 0.373797 hartree
zpe.thermalcorrenthalpy: 0.374741 hartree
zpe.thermalcorrgfe: 0.301504 hartree
zpe.sumelectzpe: -839.407849 hartree
zpe.sumelectthermal: -839.386879 hartree
zpe.sumelectthermalent: -839.385935 hartree
zpe.sumelectthermalfe: -839.459172 hartree
dipole: -15.2335 -1.2493 2.9294
dipole: 15.5628
quadrupole: -29.0955 -96.7546 -114.1165
quadrupole: 16.2457 3.8579 0.0985
quadrupole: 50.8933 -16.7657 -34.1276 16.2457 3.8579 0.0985
hfenergy: -839.760676 hartree
pointgroup: C01 [X(C14H23Br1N1O3)]
dipole: 5.6884863 0.2376315 2.2526028 debye
polarizability: 223.8108882|-38.681345|150.4228576|29.8862097|-25.7789175|195.0415302 unknown
InChI: InChI=1S/C14H23BrNO3/c1-5-16(4,6-2)10-9-11(3)18-14(17)12-7-8-13(15)19-12/h7-8,11H,5-6,9-10H2,1-4H3
charge 1 multiplicity 1
42 atoms
Br -4.758928 1.767977 -3.149358
O  -0.595813 -0.775591 0.965213
O  -0.275701 -1.047687 -1.351747
O  -2.659424 0.485923 -1.778965
N  3.62669 0.321583 -0.046361
C  2.183319 -0.22156 0.070971
C  4.03061 1.16499 1.193673
C  3.723279 1.211994 -1.319441
C  1.86241 -0.987264 1.366409
C  4.617797 -0.833233 -0.15892
C  0.514479 -1.747021 1.245844
C  3.153631 2.390237 1.474326
C  3.455409 0.494696 -2.648025
C  0.129653 -2.464226 2.540924
C  -0.965282 -0.611338 -0.393502
C  -2.215474 0.126735 -0.479684
C  -3.144443 0.564543 0.466305
C  -4.20835 1.217032 -0.242845
C  -3.874474 1.146538 -1.593576
H  1.516167 0.648958 -0.034683
H  2.015731 -0.867576 -0.803721
H  5.080458 1.462617 1.022191
H  4.011617 0.470765 2.050126
H  4.739562 1.645205 -1.301918
H  2.995219 2.02612 -1.175174
H  1.804056 -0.306097 2.235498
H  2.631189 -1.752533 1.586797
H  4.285119 -1.529319 -0.941238
H  5.610416 -0.430198 -0.413885
H  4.676106 -1.361116 0.803865
H  0.56137 -2.450382 0.392247
H  2.093307 2.131126 1.632762
H  3.221661 3.161572 0.690547
H  3.515812 2.852545 2.409513
H  2.434472 0.085095 -2.72034
H  4.18508 -0.302166 -2.866365
H  3.554479 1.245356 -3.45224
H  -0.831789 -2.98828 2.416103
H  0.027966 -1.750062 3.37644
H  0.895329 -3.214156 2.809827
H  -3.067381 0.417996 1.541154
H  -5.102934 1.672603 0.173253
