program: Orca
programVersion: 5.0.2
elementType: Si F O O C C C C C C C C C C C C C C C C C C C C C C C C C H H H H H H H H H H H H H H H H H H H H H H H H H H H H H
charge: 0
multiplicity: 1
keywords: wb97x-d3
keywords: def2-TZVPP
keywords: def2/J RIJCOSX
keywords: DEFGRID2
keywords: scfconv7
keywords: smallprint printgap noloewdin
keywords: NOSOSCF
formula: C25H29FO2Si
InChI: InChI=1/C25H29FO2Si/c1-4-27-21-13-15-23(16-14-21)29(2,3)18-8-9-20-12-17-24(26)25(19-20)28-22-10-6-5-7-11-22/h5-7,10-17,19H,4,8-9,18H2,1-3H3
58 atoms
Si -3.351788 1.479735 0.257095
F  1.89157 -4.031006 0.249471
O  2.488363 2.510735 -0.856977
O  1.974897 -1.355606 -0.217288
C  -3.524184 -0.372213 0.659331
C  -3.849337 -1.296817 -0.514825
C  -1.568267 1.901173 -0.144022
C  -3.867039 2.464749 1.781339
C  -4.464588 1.9400 -1.19514
C  -2.746006 -1.422971 -1.569852
C  -0.602793 1.889286 0.870108
C  -1.116371 2.162063 -1.433726
C  -1.503639 -2.112984 -1.074017
C  0.73449 2.10686 0.615103
C  0.228471 2.37166 -1.720741
C  1.166145 2.336211 -0.692389
C  -0.327195 -1.407474 -0.848443
C  -1.507329 -3.484686 -0.832476
C  0.816202 -2.050076 -0.40181
C  -0.370217 -4.140772 -0.388738
C  0.78631 -3.417043 -0.176418
C  3.014913 2.616745 -2.161506
C  4.519059 2.705055 -2.04794
C  2.238029 -0.836849 1.014356
C  1.385414 -0.963099 2.102846
C  3.427656 -0.128521 1.135149
C  1.730147 -0.367865 3.30859
C  3.756546 0.458792 2.343381
C  2.909501 0.347433 3.438765
H  -2.612614 -0.71209 1.16268
H  -4.319905 -0.46827 1.405641
H  -4.759357 -0.948823 -1.011879
H  -4.084595 -2.297189 -0.137186
H  -4.911012 2.282196 2.04182
H  -3.267649 2.206336 2.655906
H  -3.749358 3.536191 1.61455
H  -4.20931 1.403282 -2.110574
H  -5.509106 1.713918 -0.973955
H  -4.403448 3.00702 -1.414361
H  -3.144434 -1.982278 -2.420993
H  -2.481966 -0.435859 -1.957493
H  -0.893626 1.691425 1.89607
H  -1.819571 2.194366 -2.258593
H  1.461526 2.084747 1.416918
H  0.522645 2.557299 -2.744931
H  -0.283552 -0.340502 -1.027439
H  -2.409727 -4.058418 -1.006222
H  -0.373371 -5.208149 -0.212134
H  2.620225 3.506385 -2.667327
H  2.729413 1.744201 -2.761565
H  4.962743 2.79005 -3.039587
H  4.821861 3.575781 -1.467537
H  4.93011 1.81528 -1.5715
H  0.451855 -1.503221 2.020537
H  4.078799 -0.033181 0.276879
H  1.061026 -0.467558 4.153466
H  4.681308 1.014178 2.427761
H  3.16908 0.809618 4.381406
totalener: -1510.04838051 hartree
nucrepener: 3039.09763824 hartree
electener: -4549.14601875 hartree
oneelecener: -8107.75550128 hartree
twoeener: 3558.60948253 hartree
kineticenergy: 1503.95999961 hartree
xcener: -135.242660399564 hartree
chargesum: 0.0000000
charge: 0.428853 -0.193753 -0.279879 -0.299458 -0.247469 -0.142671 -0.083148 -0.422347 -0.413143 -0.130815 -0.092552 -0.163028 -0.055030 -0.234303 -0.176591 0.302222 -0.057437 -0.096400 0.080209 -0.210273 0.290051 0.033108 -0.256727 0.349594 -0.186078 -0.218996 -0.139194 -0.077229 -0.165869 0.075940 0.093207 0.080623 0.086494 0.091384 0.088726 0.097205 0.088090 0.103014 0.111301 0.099794 0.070864 0.100537 0.112656 0.135180 0.102008 0.089660 0.113976 0.119845 0.081578 0.085304 0.080831 0.087771 0.079859 0.112557 0.108578 0.123420 0.117118 0.120835
qa: 0.4289 -0.1938 -0.2799 -0.2995 -0.2475 -0.1427 -0.0831 -0.4223 -0.4131 -0.1308 -0.0926 -0.1630 -0.0550 -0.2343 -0.1766 0.3022 -0.0574 -0.0964 0.0802 -0.2103 0.2901 0.0331 -0.2567 0.3496 -0.1861 -0.2190 -0.1392 -0.0772 -0.1659 0.0759 0.0932 0.0806 0.0865 0.0914 0.0887 0.0972 0.0881 0.1030 0.1113 0.0998 0.0709 0.1005 0.1127 0.1352 0.1020 0.0897 0.1140 0.1198 0.0816 0.0853 0.0808 0.0878 0.0799 0.1126 0.1086 0.1234 0.1171 0.1208
va: 4.1354 1.1048 2.1214 2.1133 3.8127 3.8883 3.6871 3.9099 3.9040 3.8307 3.8930 3.9580 3.7292 4.0112 3.8906 3.8601 3.8274 3.8782 3.8000 3.9921 4.0278 3.8509 3.9892 3.6704 3.8792 3.9851 3.9419 3.9299 3.9619 1.0221 1.0059 1.0035 1.0054 1.0136 1.0164 1.0137 1.0119 1.0116 1.0120 1.0062 1.0215 1.0035 0.9971 1.0085 1.0183 0.9914 1.0062 1.0093 0.9842 0.9861 1.0086 1.0049 1.0053 1.0208 1.0190 1.0005 1.0016 1.0022
dispcorr: -0.036242880 hartree
energy: -1510.084623391037
dipole: -18.81719 18.23308 -0.58411 20.73936 -20.36705 0.37231 -4.42911 3.93666 -0.49244
magnitude: 0.84988 au
magnitude: 2.16023 debye
