program: Orca
programVersion: 5.0.2
elementType: Si F O O C C C C C C C C C C C C C C C C C C C C C C C C C H H H H H H H H H H H H H H H H H H H H H H H H H H H H H
charge: 0
multiplicity: 1
keywords: wb97x-d3
keywords: def2-TZVPP
keywords: def2/J RIJCOSX
keywords: DEFGRID2
keywords: scfconv7
keywords: smallprint printgap noloewdin
keywords: NOSOSCF
formula: C25H29FO2Si
InChI: InChI=1/C25H29FO2Si/c1-4-27-21-13-15-23(16-14-21)29(2,3)18-8-9-20-12-17-24(26)25(19-20)28-22-10-6-5-7-11-22/h5-7,10-17,19H,4,8-9,18H2,1-3H3
58 atoms
Si -3.751864 1.414342 0.314791
F  1.704223 -3.204249 -2.258773
O  2.055737 3.079615 0.440962
O  2.010996 -2.328447 0.320869
C  -3.714618 -0.46461 0.089432
C  -3.17987 -1.197382 1.318891
C  -1.971015 1.998783 0.40301
C  -4.648739 1.862426 1.911277
C  -4.615144 2.217077 -1.155354
C  -2.80175 -2.659114 1.057351
C  -1.238733 2.268079 -0.75834
C  -1.286208 2.114783 1.60947
C  -1.608915 -2.804272 0.152667
C  0.093899 2.625738 -0.717862
C  0.056281 2.465052 1.676138
C  0.762674 2.720962 0.50412
C  -0.339274 -2.461422 0.614691
C  -1.734193 -3.254288 -1.155103
C  0.77785 -2.590242 -0.190038
C  -0.623487 -3.383212 -1.979453
C  0.622223 -3.062256 -1.489661
C  2.854384 3.064379 1.608534
C  3.239257 1.668313 2.060508
C  2.796061 -1.382424 -0.27601
C  4.167119 -1.522913 -0.10986
C  2.275611 -0.304556 -0.97777
C  5.021783 -0.582894 -0.66145
C  3.145414 0.62352 -1.530539
C  4.517002 0.491204 -1.381512
H  -4.707217 -0.847276 -0.170482
H  -3.075057 -0.669785 -0.776391
H  -3.929522 -1.167468 2.11432
H  -2.300188 -0.680576 1.717222
H  -5.687916 1.530052 1.884363
H  -4.189935 1.402611 2.788092
H  -4.65395 2.941015 2.074247
H  -5.664947 1.923083 -1.203183
H  -4.581242 3.305507 -1.092529
H  -4.160548 1.929925 -2.104871
H  -2.590262 -3.149179 2.011886
H  -3.657687 -3.184983 0.626493
H  -1.71831 2.203155 -1.728717
H  -1.803122 1.930161 2.544594
H  0.634957 2.842582 -1.630493
H  0.528479 2.535476 2.646494
H  -0.202421 -2.09916 1.626871
H  -2.710975 -3.519221 -1.539542
H  -0.719776 -3.744617 -2.994585
H  2.368908 3.622938 2.417089
H  3.75047 3.623446 1.338426
H  2.376176 1.058665 2.325836
H  3.790387 1.143735 1.281837
H  3.880397 1.73718 2.940444
H  4.553033 -2.369635 0.442268
H  1.206287 -0.170529 -1.083359
H  6.090272 -0.697879 -0.53411
H  2.740062 1.465236 -2.074909
H  5.186183 1.220929 -1.816481
totalener: -1510.04796822 hartree
nucrepener: 2986.70347194 hartree
electener: -4496.75144017 hartree
oneelecener: -8002.97013939 hartree
twoeener: 3506.21869923 hartree
kineticenergy: 1503.95985374 hartree
xcener: -135.240264292513 hartree
chargesum: -0.0000000
charge: 0.431640 -0.195307 -0.289541 -0.302947 -0.218847 -0.113855 -0.112457 -0.404696 -0.417583 -0.130094 -0.035969 -0.135346 0.047647 -0.337047 -0.220726 0.362971 -0.194095 -0.162047 0.116635 -0.139980 0.245214 0.016932 -0.240558 0.253253 -0.206514 -0.116171 -0.091768 -0.123454 -0.163697 0.075117 0.075895 0.083015 0.063891 0.098810 0.085194 0.108176 0.093634 0.102152 0.086684 0.098117 0.073374 0.104455 0.114663 0.120798 0.106957 0.109626 0.112477 0.122061 0.078083 0.100792 0.085224 0.079658 0.090460 0.119797 0.131495 0.119903 0.116872 0.121028
qa: 0.4316 -0.1953 -0.2895 -0.3029 -0.2188 -0.1139 -0.1125 -0.4047 -0.4176 -0.1301 -0.0360 -0.1353 0.0476 -0.3370 -0.2207 0.3630 -0.1941 -0.1620 0.1166 -0.1400 0.2452 0.0169 -0.2406 0.2533 -0.2065 -0.1162 -0.0918 -0.1235 -0.1637 0.0751 0.0759 0.0830 0.0639 0.0988 0.0852 0.1082 0.0936 0.1022 0.0867 0.0981 0.0734 0.1045 0.1147 0.1208 0.1070 0.1096 0.1125 0.1221 0.0781 0.1008 0.0852 0.0797 0.0905 0.1198 0.1315 0.1199 0.1169 0.1210
va: 4.1938 1.0984 2.1041 2.0981 3.8054 3.8725 3.7870 3.8973 3.9163 3.8915 3.8702 3.9505 3.6581 4.0419 3.9664 3.7438 3.9886 3.9110 3.8438 3.9396 4.0156 3.8876 3.9124 3.7761 4.0095 3.8378 3.9169 3.9136 3.9543 1.0136 1.0199 1.0070 1.0072 1.0107 1.0125 1.0109 1.0145 1.0111 1.0153 1.0045 1.0118 0.9968 0.9944 1.0132 1.0114 1.0216 1.0102 1.0069 0.9975 0.9946 1.0052 1.0073 1.0169 1.0164 1.0058 1.0001 1.0075 1.0024
dispcorr: -0.034329162 hartree
energy: -1510.082297384641
dipole: -19.58784 19.16025 -0.42759 17.01039 -16.77409 0.23630 13.51912 -12.97768 0.54144
magnitude: 0.72926 au
magnitude: 1.85364 debye
