program: Orca
programVersion: 5.0.2
elementType: Si F O O C C C C C C C C C C C C C C C C C C C C C C C C C H H H H H H H H H H H H H H H H H H H H H H H H H H H H H
charge: 0
multiplicity: 1
keywords: wb97x-d3
keywords: def2-TZVPP
keywords: def2/J RIJCOSX
keywords: DEFGRID2
keywords: scfconv7
keywords: smallprint printgap noloewdin
keywords: NOSOSCF
formula: C25H29FO2Si
InChI: InChI=1/C25H29FO2Si/c1-4-27-21-13-15-23(16-14-21)29(2,3)18-8-9-20-12-17-24(26)25(19-20)28-22-10-6-5-7-11-22/h5-7,10-17,19H,4,8-9,18H2,1-3H3
58 atoms
Si -1.209297 0.68879 2.326598
F  -0.767315 -5.584194 -2.241447
O  -1.629852 6.721087 2.089674
O  1.483224 -4.410856 -1.481923
C  -0.475796 0.088138 0.692137
C  -1.274725 0.506593 -0.539019
C  -1.32298 2.56744 2.284099
C  -0.079006 0.14179 3.730092
C  -2.930701 -0.031513 2.573824
C  -0.677208 0.020809 -1.864978
C  -0.220437 3.340312 1.919742
C  -2.503008 3.258031 2.579514
C  -0.68773 -1.475868 -1.996006
C  -0.272807 4.726832 1.843264
C  -2.581269 4.637529 2.511707
C  -1.464233 5.386523 2.138417
C  0.449177 -2.227279 -1.712712
C  -1.857168 -2.141489 -2.356565
C  0.427769 -3.612936 -1.80024
C  -1.894308 -3.525019 -2.438087
C  -0.751536 -4.245656 -2.164796
C  -0.540169 7.542972 1.692621
C  -1.008831 8.976594 1.709716
C  2.759392 -4.062672 -1.82927
C  3.762983 -4.445342 -0.949808
C  3.068083 -3.417163 -3.020272
C  5.086845 -4.179446 -1.265897
C  4.397054 -3.147612 -3.316563
C  5.410508 -3.524191 -2.446048
H  0.553693 0.456283 0.609751
H  -0.393324 -1.003407 0.743773
H  -1.344089 1.597468 -0.580274
H  -2.304557 0.143143 -0.462981
H  0.029494 -0.945311 3.750912
H  0.922821 0.565248 3.62984
H  -0.467029 0.44964 4.703447
H  -2.895975 -1.123458 2.556958
H  -3.361174 0.258525 3.534658
H  -3.629189 0.280532 1.79487
H  -1.246688 0.458437 -2.689146
H  0.345477 0.395234 -1.958381
H  0.722822 2.861046 1.678029
H  -3.395241 2.71281 2.866027
H  0.616233 5.269138 1.550208
H  -3.509741 5.146314 2.742795
H  1.363019 -1.723654 -1.419745
H  -2.752897 -1.575191 -2.581015
H  -2.80143 -4.042873 -2.722969
H  -0.201558 7.264355 0.688934
H  0.305173 7.409927 2.376259
H  -1.836687 9.136351 1.018021
H  -1.325304 9.28394 2.707024
H  -0.189886 9.628241 1.404627
H  3.506372 -4.952061 -0.027789
H  2.291632 -3.12852 -3.717442
H  5.867005 -4.481479 -0.579163
H  4.637664 -2.643605 -4.24383
H  6.443723 -3.312332 -2.687495
elementType: Si F O C H
totalener: -1510.07181534 hartree
nucrepener: 2685.33518537 hartree
electener: -4195.40700071 hartree
oneelecener: -7400.73498109 hartree
twoeener: 3205.32798037 hartree
cpcmener: -0.02372798 hartree
kineticenergy: 1503.90973033 hartree
xcener: -135.228138218535 hartree
chargesum: 0.0000000
charge: 0.490207 -0.218159 -0.325022 -0.327030 -0.268949 -0.137699 -0.178725 -0.421330 -0.442593 -0.093374 -0.164295 -0.086583 0.039451 -0.242386 -0.286733 0.340528 -0.235445 -0.216325 0.236026 -0.169947 0.174404 0.061593 -0.272020 0.301584 -0.258383 -0.200541 -0.116124 -0.143857 -0.191157 0.083894 0.087122 0.085040 0.084601 0.101704 0.100122 0.101443 0.110933 0.106831 0.104448 0.097029 0.085521 0.133110 0.140039 0.137076 0.133137 0.145758 0.142932 0.147702 0.093025 0.092758 0.086983 0.087013 0.088584 0.145886 0.155439 0.157873 0.159721 0.157158
qa: 0.4902 -0.2182 -0.3250 -0.3270 -0.2689 -0.1377 -0.1787 -0.4213 -0.4426 -0.0934 -0.1643 -0.0866 0.0395 -0.2424 -0.2867 0.3405 -0.2354 -0.2163 0.2360 -0.1699 0.1744 0.0616 -0.2720 0.3016 -0.2584 -0.2005 -0.1161 -0.1439 -0.1912 0.0839 0.0871 0.0850 0.0846 0.1017 0.1001 0.1014 0.1109 0.1068 0.1044 0.0970 0.0855 0.1331 0.1400 0.1371 0.1331 0.1458 0.1429 0.1477 0.0930 0.0928 0.0870 0.0870 0.0886 0.1459 0.1554 0.1579 0.1597 0.1572
va: 4.1495 1.0674 2.0819 2.0814 3.8293 3.8687 3.7743 3.8912 3.9122 3.8407 3.9046 3.8471 3.6309 3.8855 4.0452 3.7577 3.8758 3.9128 3.6729 3.8852 4.0676 3.8013 3.9752 3.6900 4.0083 3.9071 3.8823 3.8908 3.9107 1.0159 1.0154 1.0108 1.0015 1.0086 1.0094 1.0087 1.0078 1.0078 1.0061 1.0057 1.0106 0.9961 0.9892 1.0130 1.0147 1.0061 1.0009 0.9985 0.9863 0.9858 1.0036 1.0035 1.0058 1.0087 0.9981 0.9891 0.9901 0.9910
dispcorr: -0.026172643 hartree
energy: -1510.097987982424
dipole: -3.20938 3.95844 0.74906 37.50627 -35.72052 1.78575 15.79915 -16.19595 -0.39680
magnitude: 1.97673 au
magnitude: 5.02444 debye
