program: Orca
programVersion: 5.0.2
elementType: Si F O O C C C C C C C C C C C C C C C C C C C C C C C C C H H H H H H H H H H H H H H H H H H H H H H H H H H H H H
charge: 0
multiplicity: 1
keywords: wb97x-d3
keywords: def2-TZVPP
keywords: def2/J RIJCOSX
keywords: DEFGRID2
keywords: scfconv7
keywords: smallprint printgap noloewdin
keywords: NOSOSCF
formula: C25H29FO2Si
InChI: InChI=1/C25H29FO2Si/c1-4-27-21-13-15-23(16-14-21)29(2,3)18-8-9-20-12-17-24(26)25(19-20)28-22-10-6-5-7-11-22/h5-7,10-17,19H,4,8-9,18H2,1-3H3
58 atoms
Si -3.834353 0.657607 0.66582
F  1.744789 -1.418677 1.234153
O  1.876269 2.609751 1.047121
O  1.452853 -0.094944 -1.165709
C  -4.236661 -0.096604 -1.031592
C  -4.198648 -1.624284 -1.197495
C  -2.051635 1.231326 0.824453
C  -4.238781 -0.542646 2.058049
C  -4.925957 2.1879 0.842069
C  -2.916255 -2.180115 -1.81688
C  -1.235607 0.859526 1.8877
C  -1.494267 2.10137 -0.122722
C  -1.671352 -1.975908 -1.000022
C  0.078324 1.302209 2.010559
C  -0.19386 2.554775 -0.023487
C  0.611262 2.146316 1.043104
C  -0.641782 -1.162339 -1.46162
C  -1.508927 -2.618544 0.225303
C  0.512868 -0.974628 -0.718331
C  -0.357861 -2.443907 0.978456
C  0.636699 -1.615466 0.504842
C  2.777129 2.136807 2.04019
C  4.128923 2.755697 1.787139
C  2.741307 -0.494927 -1.375684
C  3.687079 0.521323 -1.443391
C  3.114139 -1.820421 -1.554789
C  5.015053 0.204756 -1.680377
C  4.450937 -2.120836 -1.78364
C  5.407053 -1.117861 -1.845115
H  -5.256388 0.245051 -1.240707
H  -3.624102 0.383687 -1.803269
H  -5.019107 -1.93109 -1.851803
H  -4.388754 -2.128268 -0.245279
H  -3.588787 -1.419341 2.070203
H  -4.15178 -0.057916 3.033074
H  -5.267216 -0.901951 1.974261
H  -4.75862 2.897699 0.02827
H  -5.987271 1.927841 0.829805
H  -4.729286 2.716613 1.777381
H  -3.05628 -3.251951 -1.985276
H  -2.776517 -1.732889 -2.804304
H  -1.612821 0.19391 2.655723
H  -2.083574 2.432263 -0.971922
H  0.663471 0.970977 2.857692
H  0.216903 3.215835 -0.777517
H  -0.73449 -0.650814 -2.412705
H  -2.287828 -3.271023 0.601093
H  -0.235502 -2.938416 1.933803
H  2.844034 1.044874 1.99881
H  2.418361 2.408679 3.038719
H  4.090262 3.844111 1.842836
H  4.830581 2.408801 2.546052
H  4.527399 2.470557 0.812746
H  3.379122 1.550724 -1.308251
H  2.383176 -2.619067 -1.527592
H  5.74781 1.000153 -1.729787
H  4.740624 -3.155036 -1.918871
H  6.445734 -1.362707 -2.02332
elementType: Si F O C H
totalener: -1510.06634212 hartree
nucrepener: 3066.46162403 hartree
electener: -4576.52796615 hartree
oneelecener: -8164.35845500 hartree
twoeener: 3587.83048884 hartree
cpcmener: -0.02294533 hartree
kineticenergy: 1503.91667039 hartree
xcener: -135.235022332859 hartree
chargesum: -0.0000000
charge: 0.474785 -0.223553 -0.327410 -0.313282 -0.278250 -0.129769 -0.104289 -0.444564 -0.464062 -0.108575 -0.157944 -0.125448 0.093398 -0.233054 -0.277464 0.335874 -0.259446 -0.231494 0.187688 -0.148631 0.261180 0.035612 -0.269320 0.325753 -0.300844 -0.200051 -0.109305 -0.158789 -0.190444 0.110088 0.081709 0.088107 0.077433 0.103512 0.111442 0.114239 0.099815 0.098665 0.097163 0.096991 0.082450 0.139347 0.130394 0.131264 0.128829 0.125110 0.145637 0.144425 0.096534 0.109153 0.090988 0.091243 0.079159 0.145617 0.151259 0.157341 0.157621 0.156166
qa: 0.4748 -0.2236 -0.3274 -0.3133 -0.2782 -0.1298 -0.1043 -0.4446 -0.4641 -0.1086 -0.1579 -0.1254 0.0934 -0.2331 -0.2775 0.3359 -0.2594 -0.2315 0.1877 -0.1486 0.2612 0.0356 -0.2693 0.3258 -0.3008 -0.2001 -0.1093 -0.1588 -0.1904 0.1101 0.0817 0.0881 0.0774 0.1035 0.1114 0.1142 0.0998 0.0987 0.0972 0.0970 0.0824 0.1393 0.1304 0.1313 0.1288 0.1251 0.1456 0.1444 0.0965 0.1092 0.0910 0.0912 0.0792 0.1456 0.1513 0.1573 0.1576 0.1562
va: 4.0814 1.0523 2.0582 2.0209 3.8300 3.8799 3.6703 3.9017 3.9069 3.8462 3.8574 3.8528 3.5142 3.8052 3.9954 3.6999 4.0349 3.9053 3.5696 3.9092 3.8645 3.7857 3.9689 3.6753 3.9571 3.9081 3.8816 3.9150 3.9152 0.9986 1.0155 1.0045 0.9986 1.0106 1.0101 1.0076 1.0102 1.0108 1.0120 1.0031 1.0086 0.9895 0.9940 1.0140 1.0143 1.0217 0.9967 1.0022 0.9908 0.9906 1.0041 1.0063 1.0048 1.0183 1.0032 0.9903 0.9909 0.9909
dispcorr: -0.037027748 hartree
energy: -1510.103369870536
dipole: -17.75886 17.36111 -0.39774 5.17255 -6.25315 -1.08060 3.14899 -2.97624 0.17274
magnitude: 1.16437 au
magnitude: 2.95958 debye
