program: Orca
programVersion: 5.0.2
elementType: Si F O O C C C C C C C C C C C C C C C C C C C C C C C C C H H H H H H H H H H H H H H H H H H H H H H H H H H H H H
charge: 0
multiplicity: 1
keywords: wb97x-d3
keywords: def2-TZVPP
keywords: def2/J RIJCOSX
keywords: DEFGRID2
keywords: scfconv7
keywords: smallprint printgap noloewdin
keywords: NOSOSCF
formula: C25H29FO2Si
InChI: InChI=1/C25H29FO2Si/c1-4-27-21-13-15-23(16-14-21)29(2,3)18-8-9-20-12-17-24(26)25(19-20)28-22-10-6-5-7-11-22/h5-7,10-17,19H,4,8-9,18H2,1-3H3
58 atoms
Si -3.53606 1.798239 0.436197
F  1.434176 -5.388766 0.285876
O  2.213661 3.654861 0.002632
O  2.116465 -2.888381 -0.385863
C  -3.733143 0.301668 -0.701151
C  -2.783647 -0.838882 -0.334532
C  -1.754131 2.395644 0.26817
C  -3.839011 1.31697 2.231708
C  -4.741423 3.157048 -0.061175
C  -2.559337 -1.85122 -1.462043
C  -1.094499 3.06042 1.309081
C  -1.015977 2.170969 -0.892952
C  -1.499184 -2.844622 -1.079061
C  0.220714 3.474588 1.198652
C  0.308482 2.570423 -1.027428
C  0.93747 3.229354 0.025653
C  -0.177347 -2.417223 -0.97267
C  -1.803483 -4.159946 -0.747597
C  0.811779 -3.264279 -0.502476
C  -0.815376 -5.029718 -0.304426
C  0.476315 -4.569933 -0.169957
C  3.001127 3.403611 -1.154055
C  4.386137 3.947115 -0.907813
C  2.430831 -1.69687 0.212415
C  1.663451 -1.133038 1.225211
C  3.602763 -1.08309 -0.2098
C  2.077587 0.058595 1.804789
C  4.010667 0.099547 0.390239
C  3.250147 0.679323 1.396849
H  -4.771903 -0.043689 -0.691083
H  -3.547314 0.630211 -1.730563
H  -3.156672 -1.362211 0.550555
H  -1.806723 -0.436969 -0.048211
H  -3.105347 0.592353 2.590855
H  -3.794558 2.181343 2.897974
H  -4.827962 0.869544 2.356396
H  -5.77826 2.829363 0.045258
H  -4.616412 4.047824 0.558516
H  -4.600142 3.462022 -1.100304
H  -3.493683 -2.364922 -1.700699
H  -2.255648 -1.313181 -2.364947
H  -1.611912 3.261077 2.241037
H  -1.468712 1.659332 -1.735236
H  0.706572 3.984463 2.022212
H  0.826951 2.357587 -1.952569
H  0.080441 -1.39822 -1.24072
H  -2.823062 -4.515356 -0.829132
H  -1.050454 -6.054285 -0.045621
H  2.553822 3.888919 -2.028353
H  3.043411 2.328586 -1.358244
H  4.370866 5.024271 -0.737709
H  4.862615 3.468896 -0.05104
H  5.007859 3.757447 -1.783019
H  0.75341 -1.608107 1.568719
H  4.192768 -1.532495 -0.998915
H  1.476429 0.497749 2.590497
H  4.927947 0.571154 0.061044
H  3.568075 1.603238 1.861201
elementType: Si F O C H
totalener: -1510.07090490 hartree
nucrepener: 2917.89976155 hartree
electener: -4427.97066645 hartree
oneelecener: -7865.84887324 hartree
twoeener: 3437.87820679 hartree
cpcmener: -0.02394913 hartree
kineticenergy: 1503.90384756 hartree
xcener: -135.228908954557 hartree
chargesum: 0.0000000
charge: 0.486501 -0.217366 -0.322045 -0.331899 -0.274763 -0.147658 -0.151971 -0.440438 -0.417978 -0.054159 -0.089837 -0.152850 0.022505 -0.296998 -0.240529 0.327369 -0.225542 -0.200947 0.206189 -0.163637 0.181881 0.018360 -0.270736 0.307531 -0.197686 -0.238115 -0.163828 -0.152057 -0.158796 0.095148 0.078129 0.100090 0.064272 0.108493 0.105746 0.110476 0.100925 0.099452 0.100442 0.083610 0.087743 0.133507 0.139100 0.130687 0.134881 0.144387 0.140327 0.147191 0.116704 0.099159 0.093125 0.083234 0.091962 0.153633 0.145448 0.157588 0.158911 0.155130
qa: 0.4865 -0.2174 -0.3220 -0.3319 -0.2748 -0.1477 -0.1520 -0.4404 -0.4180 -0.0542 -0.0898 -0.1529 0.0225 -0.2970 -0.2405 0.3274 -0.2255 -0.2009 0.2062 -0.1636 0.1819 0.0184 -0.2707 0.3075 -0.1977 -0.2381 -0.1638 -0.1521 -0.1588 0.0951 0.0781 0.1001 0.0643 0.1085 0.1057 0.1105 0.1009 0.0995 0.1004 0.0836 0.0877 0.1335 0.1391 0.1307 0.1349 0.1444 0.1403 0.1472 0.1167 0.0992 0.0931 0.0832 0.0920 0.1536 0.1454 0.1576 0.1589 0.1551
va: 4.1350 1.0691 2.0515 2.0851 3.8663 3.8685 3.7231 3.8941 3.8941 3.7944 3.8460 3.8745 3.6668 4.0142 3.8774 3.7089 3.9193 3.9118 3.6866 3.8714 4.0661 3.8014 3.9667 3.6854 3.8768 4.0069 3.8837 3.8611 3.8139 1.0145 1.0160 1.0086 0.9954 1.0047 1.0097 1.0079 1.0091 1.0102 1.0093 1.0138 1.0101 0.9902 0.9903 1.0163 1.0137 1.0027 1.0035 0.9985 0.9913 0.9797 1.0046 1.0031 1.0054 0.9990 1.0079 0.9944 0.9884 0.9973
dispcorr: -0.032506623 hartree
energy: -1510.103411522809
dipole: -16.20382 15.40474 -0.79908 29.73885 -28.93718 0.80168 -1.59810 0.88465 -0.71345
magnitude: 1.33800 au
magnitude: 3.40091 debye
