program: Orca
programVersion: 5.0.2
elementType: Si F O O C C C C C C C C C C C C C C C C C C C C C C C C C H H H H H H H H H H H H H H H H H H H H H H H H H H H H H
charge: 0
multiplicity: 1
keywords: wb97x-d3
keywords: def2-TZVPP
keywords: def2/J RIJCOSX
keywords: DEFGRID2
keywords: scfconv7
keywords: smallprint printgap noloewdin
keywords: NOSOSCF
formula: C25H29FO2Si
InChI: InChI=1/C25H29FO2Si/c1-4-27-21-13-15-23(16-14-21)29(2,3)18-8-9-20-12-17-24(26)25(19-20)28-22-10-6-5-7-11-22/h5-7,10-17,19H,4,8-9,18H2,1-3H3
58 atoms
Si -4.132971 1.630207 0.451599
F  1.710163 -4.342292 -1.57233
O  1.773938 2.848563 0.939905
O  1.713687 -1.649071 -1.714046
C  -4.471446 -0.185669 0.877244
C  -3.493305 -1.178287 0.235399
C  -2.297369 2.031525 0.566713
C  -5.082514 2.737196 1.641489
C  -4.703709 1.922173 -1.319156
C  -2.279725 -1.449048 1.127501
C  -1.474787 2.039473 -0.557679
C  -1.681921 2.300001 1.796505
C  -1.210854 -2.237142 0.427247
C  -0.108955 2.297223 -0.483666
C  -0.328798 2.560063 1.896792
C  0.472967 2.566286 0.751905
C  -0.220551 -1.576142 -0.294976
C  -1.200016 -3.629221 0.447209
C  0.758895 -2.28374 -0.969669
C  -0.224674 -4.350636 -0.227434
C  0.75122 -3.669118 -0.92346
C  2.645483 2.902962 -0.182151
C  3.987406 3.397329 0.297926
C  2.818966 -1.138308 -1.094617
C  3.786433 -0.596508 -1.93509
C  3.001258 -1.134649 0.282315
C  4.939996 -0.055944 -1.391892
C  4.162729 -0.583143 0.810139
C  5.137536 -0.046497 -0.016326
H  -4.491037 -0.329321 1.962913
H  -5.493505 -0.393238 0.541884
H  -3.149126 -0.812237 -0.738364
H  -3.991339 -2.130276 0.028767
H  -4.943301 3.795103 1.40953
H  -6.154915 2.532462 1.600684
H  -4.767786 2.585818 2.676447
H  -4.488286 2.937429 -1.658608
H  -4.233509 1.233745 -2.024817
H  -5.783044 1.774775 -1.402744
H  -1.860577 -0.501031 1.471145
H  -2.611451 -1.983942 2.021347
H  -1.892203 1.838431 -1.537975
H  -2.268045 2.303974 2.709251
H  0.476517 2.281974 -1.393302
H  0.120604 2.767986 2.860662
H  -0.204137 -0.492111 -0.330473
H  -1.961498 -4.165457 1.000256
H  -0.217624 -5.433029 -0.206315
H  2.246914 3.583614 -0.941995
H  2.735155 1.911291 -0.639184
H  3.917662 4.410792 0.695551
H  4.405243 2.750758 1.069801
H  4.688077 3.415824 -0.537003
H  3.634152 -0.606715 -3.007318
H  2.26006 -1.551314 0.951473
H  5.69139 0.358832 -2.051633
H  4.299558 -0.580754 1.883986
H  6.040081 0.376317 0.404404
elementType: Si F O C H
totalener: -1510.06987851 hartree
nucrepener: 2939.18953065 hartree
electener: -4449.25940916 hartree
oneelecener: -7908.48651688 hartree
twoeener: 3459.22710772 hartree
cpcmener: -0.02113609 hartree
kineticenergy: 1503.91098004 hartree
xcener: -135.231076268792 hartree
chargesum: 0.0000000
charge: 0.489163 -0.216562 -0.324467 -0.328269 -0.279232 -0.131726 -0.169081 -0.453648 -0.430472 -0.074958 -0.157965 -0.105339 -0.035002 -0.217236 -0.273437 0.331838 -0.111964 -0.151891 0.094700 -0.202594 0.259447 0.067826 -0.296577 0.299086 -0.219210 -0.177685 -0.129657 -0.170576 -0.201874 0.082399 0.093406 0.077403 0.093887 0.104372 0.102442 0.099646 0.109384 0.100264 0.106796 0.089259 0.094668 0.141316 0.132797 0.136787 0.133633 0.103775 0.142582 0.147832 0.112355 0.063337 0.102041 0.088553 0.096426 0.141081 0.150728 0.155058 0.156556 0.158581
qa: 0.4892 -0.2166 -0.3245 -0.3283 -0.2792 -0.1317 -0.1691 -0.4536 -0.4305 -0.0750 -0.1580 -0.1053 -0.0350 -0.2172 -0.2734 0.3318 -0.1120 -0.1519 0.0947 -0.2026 0.2594 0.0678 -0.2966 0.2991 -0.2192 -0.1777 -0.1297 -0.1706 -0.2019 0.0824 0.0934 0.0774 0.0939 0.1044 0.1024 0.0996 0.1094 0.1003 0.1068 0.0893 0.0947 0.1413 0.1328 0.1368 0.1336 0.1038 0.1426 0.1478 0.1124 0.0633 0.1020 0.0886 0.0964 0.1411 0.1507 0.1551 0.1566 0.1586
va: 4.1290 1.0727 2.0667 2.0834 3.8288 3.8678 3.7212 3.9101 3.8970 3.7551 3.8372 3.8529 3.6896 3.8219 4.0434 3.7382 3.8380 3.8757 3.7982 3.9084 4.0187 3.7627 3.9706 3.6565 3.9390 3.8200 3.8697 3.8851 3.8529 1.0111 1.0096 1.0046 1.0079 1.0092 1.0102 1.0123 1.0068 1.0100 1.0106 1.0138 1.0115 0.9905 0.9937 1.0132 1.0139 1.0368 1.0012 0.9991 0.9956 0.9933 1.0072 1.0013 1.0046 1.0105 1.0032 0.9910 0.9923 0.9903
dispcorr: -0.033379916 hartree
energy: -1510.103258428554
dipole: -18.07309 17.61524 -0.45785 23.68965 -23.30692 0.38273 7.91501 -7.53315 0.38186
magnitude: 0.70847 au
magnitude: 1.80079 debye
