program: Orca
programVersion: 5.0.2
elementType: Si F O O C C C C C C C C C C C C C C C C C C C C C C C C C H H H H H H H H H H H H H H H H H H H H H H H H H H H H H
charge: 0
multiplicity: 1
keywords: wb97x-d3
keywords: def2-TZVPP
keywords: def2/J RIJCOSX
keywords: DEFGRID2
keywords: scfconv7
keywords: smallprint printgap noloewdin
keywords: NOSOSCF
formula: C25H29FO2Si
InChI: InChI=1/C25H29FO2Si/c1-4-27-21-13-15-23(16-14-21)29(2,3)18-8-9-20-12-17-24(26)25(19-20)28-22-10-6-5-7-11-22/h5-7,10-17,19H,4,8-9,18H2,1-3H3
58 atoms
Si -4.09258 0.895757 0.871469
F  1.910387 -2.102729 1.148258
O  1.785184 2.194616 1.484706
O  1.671017 -0.269277 -0.871203
C  -4.141913 -0.755045 -0.042487
C  -3.605203 -0.678324 -1.478144
C  -2.276869 1.362935 1.046406
C  -4.851204 0.685295 2.58211
C  -5.003048 2.227754 -0.095037
C  -2.80475 -1.915287 -1.904236
C  -1.702853 2.439973 0.375508
C  -1.421689 0.591855 1.845299
C  -1.522317 -2.032243 -1.128036
C  -0.351124 2.753064 0.484998
C  -0.077848 0.884655 1.974554
C  0.470864 1.975133 1.294865
C  -0.46861 -1.1566 -1.391956
C  -1.373333 -2.953973 -0.097836
C  0.688747 -1.186288 -0.63692
C  -0.216096 -2.993166 0.671868
C  0.795686 -2.101144 0.403657
C  2.389794 3.337749 0.895494
C  3.819867 3.408575 1.370666
C  2.919896 -0.688176 -1.235877
C  3.933587 0.256237 -1.129194
C  3.191403 -1.962296 -1.716822
C  5.227376 -0.084514 -1.487605
C  4.495235 -2.289576 -2.066069
C  5.519121 -1.36149 -1.94999
H  -3.543664 -1.450131 0.55776
H  -5.153635 -1.171705 -0.038463
H  -2.961308 0.196993 -1.619476
H  -4.438762 -0.53814 -2.170208
H  -4.819022 1.614087 3.155626
H  -5.897321 0.376753 2.51814
H  -4.327011 -0.075246 3.165411
H  -4.964074 3.196711 0.407198
H  -4.598128 2.362992 -1.100154
H  -6.057874 1.966191 -0.207246
H  -3.409772 -2.814025 -1.761367
H  -2.583807 -1.849187 -2.972847
H  -2.313124 3.07146 -0.260616
H  -1.807498 -0.265535 2.387112
H  0.035127 3.601797 -0.063621
H  0.560321 0.273469 2.601654
H  -0.548004 -0.428364 -2.191465
H  -2.171985 -3.652114 0.119722
H  -0.109179 -3.703125 1.482124
H  1.850361 4.245052 1.188461
H  2.350234 3.268976 -0.197116
H  4.387043 2.521153 1.087459
H  4.308163 4.273011 0.92033
H  3.875731 3.521408 2.453913
H  3.705629 1.250726 -0.767565
H  2.408507 -2.701537 -1.83007
H  6.013152 0.65443 -1.395992
H  4.70475 -3.285959 -2.433603
H  6.532469 -1.628228 -2.219167
elementType: Si F O C H
totalener: -1510.07020785 hartree
nucrepener: 3006.64045839 hartree
electener: -4516.71066624 hartree
oneelecener: -8044.82102601 hartree
twoeener: 3528.11035977 hartree
cpcmener: -0.02556694 hartree
kineticenergy: 1503.91374549 hartree
xcener: -135.232340824213 hartree
chargesum: -0.0000000
charge: 0.479385 -0.220439 -0.323177 -0.322293 -0.275512 -0.120740 -0.133913 -0.436490 -0.433735 -0.099787 -0.156221 -0.162246 0.068545 -0.211494 -0.238150 0.308070 -0.260613 -0.192471 0.182111 -0.152003 0.232785 0.017251 -0.269433 0.290991 -0.255097 -0.186620 -0.139935 -0.165549 -0.178584 0.076423 0.095333 0.065928 0.094336 0.103127 0.101747 0.099566 0.107870 0.101695 0.108606 0.086280 0.096665 0.141190 0.131070 0.135331 0.126960 0.129558 0.145135 0.146395 0.119687 0.099607 0.081348 0.091670 0.091658 0.161563 0.150687 0.152971 0.157448 0.155511
qa: 0.4794 -0.2204 -0.3232 -0.3223 -0.2755 -0.1207 -0.1339 -0.4365 -0.4337 -0.0998 -0.1562 -0.1622 0.0685 -0.2115 -0.2382 0.3081 -0.2606 -0.1925 0.1821 -0.1520 0.2328 0.0173 -0.2694 0.2910 -0.2551 -0.1866 -0.1399 -0.1655 -0.1786 0.0764 0.0953 0.0659 0.0943 0.1031 0.1017 0.0996 0.1079 0.1017 0.1086 0.0863 0.0967 0.1412 0.1311 0.1353 0.1270 0.1296 0.1451 0.1464 0.1197 0.0996 0.0813 0.0917 0.0917 0.1616 0.1507 0.1530 0.1574 0.1555
va: 4.1448 1.0599 2.0547 2.0203 3.8371 3.8635 3.6993 3.9015 3.9151 3.8610 3.9023 3.8790 3.5787 3.8797 3.9502 3.7353 3.9824 3.8757 3.5587 3.8945 3.9420 3.7947 3.9659 3.7519 3.9622 3.8914 3.9229 3.9238 3.8992 1.0168 1.0127 1.0072 1.0076 1.0085 1.0102 1.0103 1.0080 1.0075 1.0091 1.0071 1.0062 0.9894 0.9944 1.0116 1.0202 1.0190 1.0009 0.9998 0.9899 0.9789 1.0051 1.0056 1.0042 0.9907 1.0036 0.9936 0.9910 0.9908
dispcorr: -0.034505295 hartree
energy: -1510.104713149701
dipole: -19.36119 18.72009 -0.64110 13.82903 -13.70378 0.12525 -1.36147 0.50824 -0.85323
magnitude: 1.07457 au
magnitude: 2.73135 debye
