program: Orca
programVersion: 5.0.2
elementType: Si F O O C C C C C C C C C C C C C C C C C C C C C C C C C H H H H H H H H H H H H H H H H H H H H H H H H H H H H H
charge: 0
multiplicity: 1
keywords: wb97x-d3
keywords: def2-TZVPP
keywords: def2/J RIJCOSX
keywords: DEFGRID2
keywords: scfconv7
keywords: smallprint printgap noloewdin
keywords: NOSOSCF
formula: C25H29FO2Si
InChI: InChI=1/C25H29FO2Si/c1-4-27-21-13-15-23(16-14-21)29(2,3)18-8-9-20-12-17-24(26)25(19-20)28-22-10-6-5-7-11-22/h5-7,10-17,19H,4,8-9,18H2,1-3H3
58 atoms
Si -3.535426 1.330577 0.74384
F  0.937747 -4.829465 1.028571
O  2.082125 3.507506 1.28573
O  2.031688 -3.095765 -0.636758
C  -3.345265 -0.34291 -0.112934
C  -2.655181 -0.282101 -1.472948
C  -1.819348 2.080926 0.933985
C  -4.29227 1.049815 2.445569
C  -4.6210 2.485575 -0.269038
C  -2.448132 -1.652372 -2.133683
C  -0.813585 1.389713 1.62282
C  -1.466063 3.306522 0.375579
C  -1.552121 -2.54863 -1.326521
C  0.470423 1.887382 1.736754
C  -0.179863 3.829107 0.474506
C  0.801559 3.11258 1.152121
C  -0.168747 -2.38802 -1.390321
C  -2.075476 -3.508592 -0.46643
C  0.674065 -3.149984 -0.594747
C  -1.242369 -4.2859 0.326965
C  0.118751 -4.092259 0.263361
C  2.515784 4.687322 0.621253
C  4.005031 4.814227 0.823745
C  2.697505 -1.929481 -0.898114
C  2.285415 -0.697214 -0.406238
C  3.868746 -2.042253 -1.634673
C  3.056433 0.426249 -0.669566
C  4.633873 -0.911792 -1.880569
C  4.229501 0.327735 -1.405122
H  -2.786452 -0.99671 0.566258
H  -4.335188 -0.80327 -0.214387
H  -1.682383 0.211002 -1.378227
H  -3.24071 0.338078 -2.158136
H  -5.273328 0.574228 2.373461
H  -3.66448 0.401481 3.061308
H  -4.423733 1.987544 2.98962
H  -5.612062 2.049184 -0.414527
H  -4.765898 3.447782 0.226905
H  -4.209383 2.685587 -1.260205
H  -3.418347 -2.134423 -2.279209
H  -2.020023 -1.502693 -3.128297
H  -1.027569 0.429561 2.081173
H  -2.203104 3.889099 -0.165534
H  1.230529 1.330349 2.271722
H  0.03359 4.785766 0.016556
H  0.251876 -1.658288 -2.072535
H  -3.146629 -3.655697 -0.409417
H  -1.64881 -5.032264 0.997662
H  1.996682 5.562798 1.02582
H  2.281826 4.627614 -0.44687
H  4.26302 4.89058 1.880573
H  4.540704 3.965689 0.395701
H  4.361481 5.717495 0.328331
H  1.380187 -0.603608 0.180643
H  4.179554 -3.010628 -2.006504
H  2.74264 1.385502 -0.27977
H  5.547468 -1.004064 -2.453723
H  4.824723 1.209902 -1.601535
elementType: Si F O C H
totalener: -1510.07190273 hartree
nucrepener: 2883.41135722 hartree
electener: -4393.48325995 hartree
oneelecener: -7796.90651764 hartree
twoeener: 3403.42325770 hartree
cpcmener: -0.02274871 hartree
kineticenergy: 1503.90080813 hartree
xcener: -135.228056204186 hartree
chargesum: 0.0000000
charge: 0.494684 -0.218558 -0.331025 -0.324643 -0.266497 -0.127543 -0.185928 -0.425108 -0.448924 -0.098992 -0.089426 -0.130586 0.046075 -0.327098 -0.243903 0.359611 -0.237447 -0.242956 0.236039 -0.138321 0.162328 0.044355 -0.270216 0.332944 -0.262596 -0.273720 -0.062363 -0.085619 -0.251629 0.082581 0.087989 0.076055 0.086165 0.101598 0.100578 0.102392 0.109591 0.108091 0.102196 0.086113 0.094763 0.134249 0.142560 0.138189 0.137171 0.146771 0.142549 0.148024 0.108403 0.096464 0.087781 0.084929 0.090228 0.154053 0.143387 0.163630 0.157252 0.153309
qa: 0.4947 -0.2186 -0.3310 -0.3246 -0.2665 -0.1275 -0.1859 -0.4251 -0.4489 -0.0990 -0.0894 -0.1306 0.0461 -0.3271 -0.2439 0.3596 -0.2374 -0.2430 0.2360 -0.1383 0.1623 0.0444 -0.2702 0.3329 -0.2626 -0.2737 -0.0624 -0.0856 -0.2516 0.0826 0.0880 0.0761 0.0862 0.1016 0.1006 0.1024 0.1096 0.1081 0.1022 0.0861 0.0948 0.1342 0.1426 0.1382 0.1372 0.1468 0.1425 0.1480 0.1084 0.0965 0.0878 0.0849 0.0902 0.1541 0.1434 0.1636 0.1573 0.1533
va: 4.1411 1.0661 2.0690 2.0903 3.8370 3.8604 3.7640 3.8956 3.9222 3.8550 3.8221 3.8852 3.6267 3.9994 3.9098 3.7029 3.9232 3.8852 3.6736 3.8634 4.0634 3.7954 3.9754 3.7074 3.9615 4.0178 3.7981 3.8563 3.9911 1.0132 1.0157 1.0064 1.0081 1.0088 1.0093 1.0087 1.0086 1.0080 1.0069 1.0087 1.0075 0.9922 0.9897 1.0124 1.0124 1.0036 1.0022 0.9974 0.9875 0.9872 1.0037 1.0027 1.0061 1.0014 1.0096 0.9733 0.9886 0.9954
dispcorr: -0.030643816 hartree
energy: -1510.102546547126
dipole: -15.48736 14.78983 -0.69753 31.67286 -29.92838 1.74449 -2.88918 1.87966 -1.00952
magnitude: 2.13282 au
magnitude: 5.42119 debye
