program: Orca
programVersion: 5.0.2
elementType: Si F O O C C C C C C C C C C C C C C C C C C C C C C C C C H H H H H H H H H H H H H H H H H H H H H H H H H H H H H
charge: 0
multiplicity: 1
keywords: wb97x-d3
keywords: def2-TZVPP
keywords: def2/J RIJCOSX
keywords: DEFGRID2
keywords: scfconv7
keywords: smallprint printgap noloewdin
keywords: NOSOSCF
formula: C25H29FO2Si
InChI: InChI=1/C25H29FO2Si/c1-4-27-21-13-15-23(16-14-21)29(2,3)18-8-9-20-12-17-24(26)25(19-20)28-22-10-6-5-7-11-22/h5-7,10-17,19H,4,8-9,18H2,1-3H3
58 atoms
Si -3.35073 1.404482 0.502488
F  0.489831 -4.063465 -3.321315
O  2.130881 3.941456 0.878388
O  1.894344 -3.075343 -1.280557
C  -3.114928 -0.466261 0.352304
C  -2.343208 -1.108698 1.502253
C  -1.672506 2.246278 0.648754
C  -4.371267 1.792216 2.037232
C  -4.233714 2.026538 -1.038078
C  -2.216115 -2.633199 1.39198
C  -0.978061 2.262712 1.858185
C  -1.037444 2.843311 -0.446449
C  -1.500542 -3.065581 0.143441
C  0.287252 2.823724 1.986359
C  0.218659 3.413646 -0.343746
C  0.89927 3.398165 0.875291
C  -0.125857 -2.872651 0.029876
C  -2.186718 -3.618307 -0.933488
C  0.545794 -3.202596 -1.136659
C  -1.523595 -3.965605 -2.102835
C  -0.167071 -3.745228 -2.196852
C  2.898989 3.903524 2.074453
C  4.234664 4.545217 1.793913
C  2.514263 -1.911887 -0.912881
C  3.820053 -2.025426 -0.454715
C  1.910988 -0.665672 -1.030756
C  4.526124 -0.882284 -0.110441
C  2.628687 0.467715 -0.674768
C  3.933069 0.368811 -0.211081
H  -4.106499 -0.927279 0.265295
H  -2.610893 -0.668339 -0.599236
H  -2.829753 -0.88128 2.455507
H  -1.340477 -0.67495 1.565551
H  -4.583208 2.860574 2.117618
H  -5.33108 1.270688 2.009443
H  -3.86983 1.491941 2.959642
H  -3.691806 1.77589 -1.952452
H  -5.225626 1.576364 -1.122823
H  -4.371374 3.109734 -1.023012
H  -1.683117 -3.007283 2.270439
H  -3.212361 -3.081799 1.416043
H  -1.422073 1.825419 2.745887
H  -1.528929 2.869585 -1.412625
H  0.77528 2.799131 2.951437
H  0.687914 3.867244 -1.208843
H  0.430545 -2.456332 0.862498
H  -3.254658 -3.783431 -0.86419
H  -2.059277 -4.395183 -2.93985
H  3.034175 2.867612 2.403681
H  2.380733 4.440974 2.875687
H  4.841931 4.523506 2.698964
H  4.781105 4.013512 1.013983
H  4.124655 5.587244 1.491587
H  4.279294 -3.002876 -0.374773
H  0.897053 -0.565255 -1.397467
H  5.544358 -0.9757 0.244696
H  2.158436 1.437138 -0.771076
H  4.482859 1.259697 0.063717
elementType: Si F O C H
totalener: -1510.07182956 hartree
nucrepener: 2889.99500718 hartree
electener: -4400.06683674 hartree
oneelecener: -7810.05462232 hartree
twoeener: 3409.98778559 hartree
cpcmener: -0.02327415 hartree
kineticenergy: 1503.90706305 hartree
xcener: -135.228945688201 hartree
chargesum: 0.0000000
charge: 0.493359 -0.217729 -0.325808 -0.331207 -0.239026 -0.132411 -0.147734 -0.422395 -0.461379 -0.103274 -0.178226 -0.083861 0.001136 -0.213782 -0.297819 0.301468 -0.179810 -0.190898 0.180534 -0.164677 0.190159 0.043104 -0.272245 0.295273 -0.249192 -0.197548 -0.117782 -0.154660 -0.208705 0.082651 0.081634 0.091528 0.073218 0.107501 0.105358 0.098090 0.100292 0.105295 0.106876 0.097879 0.083144 0.140111 0.138320 0.136996 0.133268 0.145670 0.139770 0.147614 0.095891 0.105291 0.090016 0.084882 0.089626 0.144843 0.150321 0.155816 0.190583 0.162650
qa: 0.4934 -0.2177 -0.3258 -0.3312 -0.2390 -0.1324 -0.1477 -0.4224 -0.4614 -0.1033 -0.1782 -0.0839 0.0011 -0.2138 -0.2978 0.3015 -0.1798 -0.1909 0.1805 -0.1647 0.1902 0.0431 -0.2722 0.2953 -0.2492 -0.1975 -0.1178 -0.1547 -0.2087 0.0827 0.0816 0.0915 0.0732 0.1075 0.1054 0.0981 0.1003 0.1053 0.1069 0.0979 0.0831 0.1401 0.1383 0.1370 0.1333 0.1457 0.1398 0.1476 0.0959 0.1053 0.0900 0.0849 0.0896 0.1448 0.1503 0.1558 0.1906 0.1627
va: 4.1481 1.0686 2.0551 2.0780 3.8101 3.8762 3.7237 3.8887 3.9286 3.8652 3.9154 3.8335 3.6516 3.8965 3.9837 3.7334 3.9021 3.8693 3.7024 3.8833 4.0628 3.7942 3.9768 3.6958 4.0038 3.9088 3.8954 3.8616 3.9263 1.0158 1.0139 1.0067 1.0044 1.0079 1.0069 1.0114 1.0105 1.0104 1.0096 1.0061 1.0099 0.9894 0.9881 1.0112 1.0151 1.0045 1.0036 0.9980 0.9857 0.9888 1.0056 1.0033 1.0038 1.0080 1.0056 0.9903 0.9660 0.9885
dispcorr: -0.030946782 hartree
energy: -1510.102776341985
dipole: -12.26126 11.79842 -0.46284 25.51340 -24.85967 0.65374 20.58258 -18.86609 1.71649
magnitude: 1.89418 au
magnitude: 4.81463 debye
