program: Orca
programVersion: 5.0.2
elementType: Si F O O C C C C C C C C C C C C C C C C C C C C C C C C C H H H H H H H H H H H H H H H H H H H H H H H H H H H H H
charge: 0
multiplicity: 1
keywords: wb97x-d3
keywords: def2-TZVPP
keywords: def2/J RIJCOSX
keywords: DEFGRID2
keywords: scfconv7
keywords: smallprint printgap noloewdin
keywords: NOSOSCF
formula: C25H29FO2Si
InChI: InChI=1/C25H29FO2Si/c1-4-27-21-13-15-23(16-14-21)29(2,3)18-8-9-20-12-17-24(26)25(19-20)28-22-10-6-5-7-11-22/h5-7,10-17,19H,4,8-9,18H2,1-3H3
58 atoms
Si -2.916138 1.533736 -0.558633
F  3.136499 -1.855863 0.886224
O  1.180913 1.423776 3.887592
O  2.3519 -1.95091 -1.660085
C  -2.429313 0.211242 -1.824887
C  -2.83927 -1.236966 -1.542787
C  -1.694644 1.535342 0.872172
C  -4.661561 1.245595 0.083512
C  -2.81026 3.206595 -1.422135
C  -2.38592 -1.82961 -0.210361
C  -2.06888 1.293294 2.190809
C  -0.332019 1.761211 0.635581
C  -0.903016 -1.844955 0.059511
C  -1.146486 1.256694 3.232681
C  0.603638 1.729041 1.651072
C  0.202974 1.464306 2.963639
C  0.034357 -1.884832 -0.967246
C  -0.443133 -1.845488 1.375181
C  1.395459 -1.88334 -0.691694
C  0.911985 -1.863418 1.664375
C  1.820321 -1.865537 0.627265
C  0.853476 1.091268 5.229575
C  2.134264 1.055935 6.025844
C  2.222692 -1.206913 -2.801284
C  1.687983 0.075926 -2.802547
C  2.702545 -1.774677 -3.973287
C  1.624549 0.7808 -3.996303
C  2.643871 -1.052558 -5.156367
C  2.098636 0.223879 -5.176358
H  -2.872148 0.508289 -2.78238
H  -1.347535 0.283648 -1.985014
H  -2.492008 -1.876308 -2.360782
H  -3.930086 -1.308525 -1.569002
H  -4.982441 2.04478 0.755216
H  -5.375997 1.217271 -0.742594
H  -4.760232 0.303073 0.625938
H  -1.812446 3.384492 -1.830149
H  -3.515122 3.275261 -2.254108
H  -3.031347 4.028252 -0.737617
H  -2.875899 -1.303412 0.613757
H  -2.759628 -2.8576 -0.154054
H  -3.11041 1.118617 2.436782
H  0.020075 1.960033 -0.371834
H  -1.499071 1.058113 4.236075
H  1.653092 1.894161 1.437492
H  -0.28862 -1.912426 -2.000954
H  -1.153945 -1.820212 2.191542
H  1.263379 -1.851085 2.688385
H  0.353954 0.116961 5.266938
H  0.16459 1.832931 5.648001
H  1.909081 0.807841 7.063165
H  2.822456 0.300513 5.644749
H  2.639609 2.022234 6.016784
H  1.326127 0.529635 -1.887902
H  3.120138 -2.773663 -3.956254
H  1.2047 1.778595 -3.997089
H  3.019462 -1.498401 -6.068425
H  2.045486 0.780705 -6.102558
elementType: Si F O C H
totalener: -1510.06827472 hartree
nucrepener: 2985.52080849 hartree
electener: -4495.58908321 hartree
oneelecener: -8001.50373933 hartree
twoeener: 3505.91465612 hartree
cpcmener: -0.02515947 hartree
kineticenergy: 1503.89620798 hartree
xcener: -135.233582574255 hartree
chargesum: -0.0000000
charge: 0.471340 -0.219101 -0.325884 -0.331018 -0.228887 -0.150659 -0.109043 -0.438083 -0.451062 -0.081021 -0.149847 -0.116453 0.038398 -0.242234 -0.330613 0.365098 -0.230829 -0.213878 0.215466 -0.177736 0.200025 0.058382 -0.273251 0.280253 -0.181187 -0.234178 -0.171100 -0.131361 -0.170474 0.096250 0.045040 0.084513 0.090439 0.111281 0.112248 0.104538 0.100303 0.100713 0.101074 0.078109 0.099906 0.141341 0.142097 0.134611 0.128190 0.153217 0.137993 0.141095 0.092248 0.096682 0.088631 0.087273 0.087519 0.158330 0.144950 0.156047 0.156871 0.157425
qa: 0.4713 -0.2191 -0.3259 -0.3310 -0.2289 -0.1507 -0.1090 -0.4381 -0.4511 -0.0810 -0.1498 -0.1165 0.0384 -0.2422 -0.3306 0.3651 -0.2308 -0.2139 0.2155 -0.1777 0.2000 0.0584 -0.2733 0.2803 -0.1812 -0.2342 -0.1711 -0.1314 -0.1705 0.0963 0.0450 0.0845 0.0904 0.1113 0.1122 0.1045 0.1003 0.1007 0.1011 0.0781 0.0999 0.1413 0.1421 0.1346 0.1282 0.1532 0.1380 0.1411 0.0922 0.0967 0.0886 0.0873 0.0875 0.1583 0.1449 0.1560 0.1569 0.1574
va: 4.1121 1.0681 2.0665 2.0888 3.8477 3.9063 3.6581 3.9137 3.9040 3.8225 3.8565 3.8210 3.6431 3.8552 4.0054 3.6801 3.8934 3.8620 3.6774 3.8389 4.0608 3.7968 3.9754 3.7184 3.8617 3.9886 3.9121 3.8936 3.8958 1.0120 1.0225 1.0010 0.9982 1.0088 1.0091 1.0070 1.0106 1.0114 1.0098 1.0079 1.0024 0.9896 0.9815 1.0130 1.0167 0.9945 1.0024 1.0026 0.9854 0.9873 1.0058 1.0033 1.0034 0.9889 1.0081 0.9934 0.9893 0.9902
dispcorr: -0.034581345 hartree
energy: -1510.102856062150
dipole: -25.47845 23.74056 -1.73789 13.23040 -13.11558 0.11482 5.01846 -4.62624 0.39221
magnitude: 1.78529 au
magnitude: 4.53785 debye
