program: Orca
programVersion: 5.0.2
elementType: Si F O O C C C C C C C C C C C C C C C C C C C C C C C C C H H H H H H H H H H H H H H H H H H H H H H H H H H H H H
charge: 0
multiplicity: 1
keywords: wb97x-d3
keywords: def2-TZVPP
keywords: def2/J RIJCOSX
keywords: DEFGRID2
keywords: scfconv7
keywords: smallprint printgap noloewdin
keywords: NOSOSCF
formula: C25H29FO2Si
InChI: InChI=1/C25H29FO2Si/c1-4-27-21-13-15-23(16-14-21)29(2,3)18-8-9-20-12-17-24(26)25(19-20)28-22-10-6-5-7-11-22/h5-7,10-17,19H,4,8-9,18H2,1-3H3
58 atoms
Si -3.274399 1.59227 -0.150892
F  2.694726 -1.896925 0.130096
O  1.871507 1.35151 3.022126
O  1.513606 -2.39916 -2.29378
C  -3.370667 -0.141164 -0.893676
C  -3.602633 -1.2288 0.16241
C  -1.708568 1.612537 0.894493
C  -4.773447 1.937763 0.932213
C  -3.136313 2.875182 -1.52063
C  -2.885291 -2.547782 -0.140921
C  -1.724662 1.442216 2.277078
C  -0.448738 1.702596 0.2896
C  -1.389854 -2.399547 -0.072022
C  -0.560193 1.358621 3.034067
C  0.722652 1.626858 1.018889
C  0.678295 1.446614 2.40386
C  -0.607264 -2.440636 -1.221748
C  -0.760588 -2.164073 1.149308
C  0.767504 -2.272712 -1.157802
C  0.612431 -1.987819 1.227773
C  1.36454 -2.051395 0.073768
C  1.936804 1.209879 4.435648
C  1.721664 2.514811 5.171391
C  2.267516 -1.346531 -2.733624
C  3.289782 -1.655711 -3.622475
C  2.029326 -0.030897 -2.359661
C  4.085181 -0.639725 -4.128042
C  2.841118 0.974537 -2.869136
C  3.87168 0.679755 -3.749533
H  -4.136988 -0.19995 -1.672475
H  -2.417723 -0.301791 -1.411321
H  -4.674183 -1.419032 0.258271
H  -3.278166 -0.896907 1.154885
H  -5.689012 1.928113 0.336163
H  -4.898409 1.193595 1.721476
H  -4.710813 2.916262 1.413097
H  -4.027978 2.875207 -2.151955
H  -3.020202 3.884692 -1.120698
H  -2.282421 2.681711 -2.173652
H  -3.208479 -3.303619 0.580176
H  -3.178266 -2.911068 -1.128986
H  -2.669725 1.370417 2.803973
H  -0.369318 1.834816 -0.784597
H  -0.646453 1.224219 4.103998
H  1.683632 1.697249 0.522565
H  -1.064514 -2.617829 -2.188372
H  -1.346077 -2.120438 2.059569
H  1.09951 -1.811144 2.178426
H  2.942396 0.836876 4.631631
H  1.241426 0.438636 4.780922
H  1.8549 2.349556 6.241472
H  2.447713 3.265793 4.858042
H  0.722159 2.924343 5.023859
H  3.460261 -2.685831 -3.910115
H  1.221517 0.222579 -1.684395
H  4.882623 -0.885594 -4.817486
H  2.657677 1.999003 -2.570726
H  4.500259 1.469133 -4.139899
elementType: Si F O C H
totalener: -1510.06791040 hartree
nucrepener: 2978.95386022 hartree
electener: -4489.02177062 hartree
oneelecener: -7988.67133091 hartree
twoeener: 3499.64956029 hartree
cpcmener: -0.02499619 hartree
kineticenergy: 1503.91062976 hartree
xcener: -135.232516039164 hartree
chargesum: 0.0000000
charge: 0.475260 -0.217676 -0.334629 -0.328530 -0.257784 -0.123422 -0.138981 -0.427147 -0.444833 -0.095008 -0.166131 -0.100096 0.076002 -0.219697 -0.314700 0.342938 -0.259103 -0.250353 0.217971 -0.160324 0.231843 0.049151 -0.262110 0.261823 -0.228633 -0.142714 -0.134386 -0.183272 -0.172508 0.093872 0.076866 0.093049 0.063415 0.108222 0.099173 0.109737 0.103139 0.103951 0.098936 0.097707 0.084165 0.142708 0.138948 0.137764 0.123709 0.134392 0.141954 0.145434 0.108466 0.082570 0.093269 0.088292 0.090497 0.143355 0.134779 0.156192 0.154989 0.157499
qa: 0.4753 -0.2177 -0.3346 -0.3285 -0.2578 -0.1234 -0.1390 -0.4271 -0.4448 -0.0950 -0.1661 -0.1001 0.0760 -0.2197 -0.3147 0.3429 -0.2591 -0.2504 0.2180 -0.1603 0.2318 0.0492 -0.2621 0.2618 -0.2286 -0.1427 -0.1344 -0.1833 -0.1725 0.0939 0.0769 0.0930 0.0634 0.1082 0.0992 0.1097 0.1031 0.1040 0.0989 0.0977 0.0842 0.1427 0.1389 0.1378 0.1237 0.1344 0.1420 0.1454 0.1085 0.0826 0.0933 0.0883 0.0905 0.1434 0.1348 0.1562 0.1550 0.1575
va: 4.1468 1.0657 2.0618 2.0783 3.8261 3.8923 3.7070 3.9066 3.9069 3.8432 3.8750 3.8234 3.5878 3.8621 3.9753 3.7154 3.9902 3.8786 3.6710 3.8353 3.9811 3.8540 3.9211 3.7353 3.9767 3.8459 3.9085 3.9310 3.8933 1.0108 1.0154 1.0085 1.0057 1.0086 1.0089 1.0077 1.0108 1.0093 1.0118 1.0044 1.0093 0.9883 0.9788 1.0060 1.0213 1.0170 1.0031 0.9996 0.9925 0.9968 1.0084 1.0055 1.0022 1.0098 1.0046 0.9894 0.9938 0.9901
dispcorr: -0.033960276 hartree
energy: -1510.101870671508
dipole: -24.06730 22.86651 -1.20079 17.28644 -16.96790 0.31853 11.62216 -10.44294 1.17923
magnitude: 1.71287 au
magnitude: 4.35378 debye
