program: Orca
programVersion: 5.0.2
elementType: Si F O O C C C C C C C C C C C C C C C C C C C C C C C C C H H H H H H H H H H H H H H H H H H H H H H H H H H H H H
charge: 0
multiplicity: 1
keywords: wb97x-d3
keywords: def2-TZVPP
keywords: def2/J RIJCOSX
keywords: DEFGRID2
keywords: scfconv7
keywords: smallprint printgap noloewdin
keywords: NOSOSCF
formula: C25H29FO2Si
InChI: InChI=1/C25H29FO2Si/c1-4-27-21-13-15-23(16-14-21)29(2,3)18-8-9-20-12-17-24(26)25(19-20)28-22-10-6-5-7-11-22/h5-7,10-17,19H,4,8-9,18H2,1-3H3
58 atoms
Si -4.172489 1.394565 0.841112
F  2.21762 -3.539503 -1.277982
O  1.803997 2.316111 0.674488
O  1.738964 -0.830073 -1.530264
C  -4.455093 -0.438821 1.283214
C  -3.290415 -1.384751 0.991782
C  -2.324544 1.748985 0.762801
C  -4.954933 2.455101 2.187874
C  -4.957116 1.820062 -0.816928
C  -2.969118 -1.516356 -0.500042
C  -1.484452 1.419454 1.835195
C  -1.714785 2.304505 -0.359525
C  -1.59694 -2.081054 -0.732802
C  -0.117731 1.612824 1.782578
C  -0.341525 2.519155 -0.434514
C  0.468827 2.164679 0.640481
C  -0.532816 -1.220054 -0.989129
C  -1.340603 -3.44534 -0.639764
C  0.751373 -1.701206 -1.176119
C  -0.054846 -3.94169 -0.810479
C  0.976041 -3.069173 -1.085314
C  2.470225 2.875813 -0.449382
C  3.934272 2.991541 -0.107384
C  2.910688 -0.803756 -0.821245
C  4.06391 -0.514798 -1.537705
C  2.957791 -1.006863 0.551091
C  5.278607 -0.441221 -0.873197
C  4.182824 -0.936253 1.201143
C  5.346058 -0.658651 0.496796
H  -4.699514 -0.491788 2.349307
H  -5.356937 -0.782632 0.763319
H  -3.502926 -2.379892 1.394848
H  -2.398293 -1.03811 1.517944
H  -4.487965 2.280523 3.159835
H  -4.859627 3.520517 1.967501
H  -6.020414 2.238758 2.297937
H  -6.033376 1.633387 -0.785816
H  -4.824263 2.872956 -1.075214
H  -4.553859 1.224738 -1.638775
H  -3.726058 -2.140422 -0.982616
H  -3.026801 -0.538449 -0.984499
H  -1.901085 0.992092 2.741523
H  -2.311526 2.579489 -1.221994
H  0.508725 1.340947 2.623958
H  0.072923 2.949819 -1.336208
H  -0.701207 -0.151593 -1.061988
H  -2.149971 -4.13672 -0.439785
H  0.145054 -5.003886 -0.74731
H  2.056569 3.862761 -0.68295
H  2.326336 2.240047 -1.329724
H  4.478053 3.385006 -0.966403
H  4.095512 3.67184 0.729771
H  4.366415 2.023163 0.144564
H  4.007671 -0.354524 -2.607248
H  2.056577 -1.214722 1.115338
H  6.177471 -0.219125 -1.433959
H  4.222102 -1.096702 2.270921
H  6.296192 -0.606756 1.011869
elementType: Si F O C H
totalener: -1510.06815587 hartree
nucrepener: 2993.86748810 hartree
electener: -4503.93564397 hartree
oneelecener: -8018.57883316 hartree
twoeener: 3514.64318919 hartree
cpcmener: -0.02237379 hartree
kineticenergy: 1503.91830164 hartree
xcener: -135.233728029449 hartree
chargesum: -0.0000000
charge: 0.486331 -0.219029 -0.320292 -0.326080 -0.293435 -0.149633 -0.143112 -0.446059 -0.434094 -0.068810 -0.133770 -0.140605 -0.017101 -0.278120 -0.231617 0.331389 -0.218082 -0.167357 0.115987 -0.190474 0.289577 0.023765 -0.272831 0.303380 -0.267480 -0.183469 -0.125189 -0.148538 -0.164964 0.100817 0.085771 0.094246 0.087641 0.099752 0.099108 0.101112 0.109725 0.104673 0.107122 0.100370 0.071200 0.138797 0.141954 0.131775 0.133406 0.153065 0.142939 0.146559 0.119924 0.100575 0.096039 0.097625 0.065954 0.142115 0.152410 0.153518 0.156913 0.154608
qa: 0.4863 -0.2190 -0.3203 -0.3261 -0.2934 -0.1496 -0.1431 -0.4461 -0.4341 -0.0688 -0.1338 -0.1406 -0.0171 -0.2781 -0.2316 0.3314 -0.2181 -0.1674 0.1160 -0.1905 0.2896 0.0238 -0.2728 0.3034 -0.2675 -0.1835 -0.1252 -0.1485 -0.1650 0.1008 0.0858 0.0942 0.0876 0.0998 0.0991 0.1011 0.1097 0.1047 0.1071 0.1004 0.0712 0.1388 0.1420 0.1318 0.1334 0.1531 0.1429 0.1466 0.1199 0.1006 0.0960 0.0976 0.0660 0.1421 0.1524 0.1535 0.1569 0.1546
va: 4.0824 1.0630 2.0531 2.0358 3.8706 3.8575 3.6981 3.8996 3.8990 3.7674 3.8646 3.8486 3.7319 3.9999 3.8677 3.7066 3.8751 3.9014 3.8341 3.9454 3.9202 3.7895 3.9600 3.5262 3.9804 3.8710 3.8593 3.9050 3.8593 1.0058 1.0100 1.0094 1.0078 1.0112 1.0116 1.0098 1.0109 1.0078 1.0079 1.0088 1.0208 0.9877 0.9908 1.0148 1.0139 1.0034 1.0003 1.0001 0.9915 0.9817 1.0063 1.0082 1.0085 1.0107 1.0024 0.9914 0.9910 0.9915
dispcorr: -0.035285310 hartree
energy: -1510.103441182842
dipole: -20.30282 19.68566 -0.61715 19.01301 -18.75152 0.26149 7.67120 -7.69214 -0.02094
magnitude: 0.67059 au
magnitude: 1.70452 debye
