program: Orca
programVersion: 5.0.2
elementType: Si F O O C C C C C C C C C C C C C C C C C C C C C C C C C H H H H H H H H H H H H H H H H H H H H H H H H H H H H H
charge: 0
multiplicity: 1
keywords: wb97x-d3
keywords: def2-TZVPP
keywords: def2/J RIJCOSX
keywords: DEFGRID2
keywords: scfconv7
keywords: smallprint printgap noloewdin
keywords: NOSOSCF
formula: C25H29FO2Si
InChI: InChI=1/C25H29FO2Si/c1-4-27-21-13-15-23(16-14-21)29(2,3)18-8-9-20-12-17-24(26)25(19-20)28-22-10-6-5-7-11-22/h5-7,10-17,19H,4,8-9,18H2,1-3H3
58 atoms
Si -2.674829 1.369706 0.460862
F  0.91161 -4.18286 -3.204935
O  2.625092 4.097885 1.498998
O  1.678856 -3.356523 -0.764341
C  -2.256557 -0.464739 0.631292
C  -3.412708 -1.436128 0.41102
C  -1.070269 2.308924 0.75505
C  -3.950792 1.870079 1.752502
C  -3.326604 1.739149 -1.264875
C  -3.025662 -2.912674 0.592945
C  -0.361001 2.135696 1.95027
C  -0.495931 3.151649 -0.194015
C  -1.979083 -3.348095 -0.391467
C  0.851507 2.756676 2.17949
C  0.724383 3.788281 0.012439
C  1.414771 3.582654 1.203819
C  -0.627882 -3.213861 -0.088521
C  -2.332586 -3.812911 -1.656238
C  0.347677 -3.491258 -1.034108
C  -1.365881 -4.118448 -2.603042
C  -0.034922 -3.935413 -2.289194
C  3.230788 5.046804 0.629355
C  2.614449 6.425096 0.73838
C  2.118995 -2.145844 -0.294853
C  3.155036 -2.16282 0.627817
C  1.583614 -0.942103 -0.737673
C  3.655666 -0.962263 1.112031
C  2.087577 0.249129 -0.236647
C  3.121417 0.247513 0.690196
H  -1.447048 -0.670468 -0.077265
H  -1.821999 -0.626551 1.625128
H  -3.829879 -1.302928 -0.592151
H  -4.225639 -1.214488 1.108959
H  -3.607927 1.645093 2.76505
H  -4.163061 2.940648 1.711527
H  -4.898724 1.34672 1.607323
H  -4.274256 1.22455 -1.440272
H  -3.513359 2.804873 -1.413338
H  -2.635104 1.412783 -2.044364
H  -2.664156 -3.06362 1.613561
H  -3.919663 -3.530846 0.479919
H  -0.755253 1.492854 2.730549
H  -0.997644 3.327065 -1.139112
H  1.382083 2.595804 3.110488
H  1.117528 4.423744 -0.769888
H  -0.326998 -2.868826 0.894156
H  -3.377864 -3.935532 -1.912654
H  -1.643252 -4.477022 -3.586237
H  3.22374 4.687594 -0.404311
H  4.274321 5.082096 0.942752
H  2.665171 6.796503 1.762558
H  3.169583 7.118502 0.105092
H  1.572932 6.449625 0.417352
H  3.563546 -3.107487 0.964575
H  0.783673 -0.923223 -1.46759
H  4.462069 -0.977836 1.834083
H  1.665603 1.185546 -0.579001
H  3.507313 1.181575 1.077284
elementType: Si F O C H
totalener: -1510.06876896 hartree
nucrepener: 2908.03703507 hartree
electener: -4418.10580403 hartree
oneelecener: -7846.36505200 hartree
twoeener: 3428.25924797 hartree
cpcmener: -0.02365219 hartree
kineticenergy: 1503.91612736 hartree
xcener: -135.232985015860 hartree
chargesum: -0.0000000
charge: 0.506318 -0.217361 -0.340123 -0.336646 -0.229108 -0.146448 -0.182659 -0.423342 -0.449857 -0.097860 -0.074258 -0.150057 0.061945 -0.337553 -0.224756 0.350239 -0.237188 -0.211623 0.197998 -0.168765 0.190702 0.042230 -0.258328 0.275846 -0.231495 -0.188439 -0.128232 -0.172311 -0.184442 0.060176 0.088661 0.081298 0.081494 0.103416 0.105614 0.101231 0.108096 0.106788 0.107745 0.087557 0.091203 0.129996 0.138442 0.129925 0.137746 0.151269 0.142655 0.147463 0.085068 0.108632 0.088560 0.094255 0.090328 0.144689 0.156012 0.156057 0.183206 0.157987
qa: 0.5063 -0.2174 -0.3401 -0.3366 -0.2291 -0.1464 -0.1827 -0.4233 -0.4499 -0.0979 -0.0743 -0.1501 0.0619 -0.3376 -0.2248 0.3502 -0.2372 -0.2116 0.1980 -0.1688 0.1907 0.0422 -0.2583 0.2758 -0.2315 -0.1884 -0.1282 -0.1723 -0.1844 0.0602 0.0887 0.0813 0.0815 0.1034 0.1056 0.1012 0.1081 0.1068 0.1077 0.0876 0.0912 0.1300 0.1384 0.1299 0.1377 0.1513 0.1427 0.1475 0.0851 0.1086 0.0886 0.0943 0.0903 0.1447 0.1560 0.1561 0.1832 0.1580
va: 4.1071 1.0691 2.0478 2.0753 3.8228 3.9260 3.7652 3.8941 3.9238 3.8550 3.8173 3.8582 3.5934 4.0375 3.8737 3.6398 3.9163 3.9128 3.6765 3.8796 4.0731 3.8599 3.9248 3.7005 4.0012 3.8852 3.9285 3.8483 3.8804 1.0289 1.0145 1.0025 1.0089 1.0077 1.0092 1.0079 1.0088 1.0082 1.0062 1.0096 1.0078 0.9946 0.9917 1.0178 1.0073 1.0018 1.0015 0.9981 0.9958 0.9922 1.0053 1.0087 1.0025 1.0068 0.9997 0.9900 0.9734 0.9975
dispcorr: -0.032635773 hartree
energy: -1510.101404728018
dipole: -16.45117 15.52857 -0.92260 30.75001 -29.42991 1.32009 11.49697 -11.33755 0.15942
magnitude: 1.61841 au
magnitude: 4.11368 debye
