program: Orca
programVersion: 5.0.2
elementType: Si F O O C C C C C C C C C C C C C C C C C C C C C C C C C H H H H H H H H H H H H H H H H H H H H H H H H H H H H H
charge: 0
multiplicity: 1
keywords: wb97x-d3
keywords: def2-TZVPP
keywords: def2/J RIJCOSX
keywords: DEFGRID2
keywords: scfconv7
keywords: smallprint printgap noloewdin
keywords: NOSOSCF
formula: C25H29FO2Si
InChI: InChI=1/C25H29FO2Si/c1-4-27-21-13-15-23(16-14-21)29(2,3)18-8-9-20-12-17-24(26)25(19-20)28-22-10-6-5-7-11-22/h5-7,10-17,19H,4,8-9,18H2,1-3H3
58 atoms
Si -2.939631 1.240222 0.786329
F  1.066111 -3.477575 -3.497297
O  2.179544 4.466976 0.834861
O  1.797108 -3.099054 -0.95958
C  -2.364338 -0.556891 0.695277
C  -3.451621 -1.596794 0.441194
C  -1.383699 2.301628 0.776492
C  -3.924426 1.555585 2.357442
C  -3.993596 1.644676 -0.72142
C  -2.931636 -3.042679 0.423629
C  -0.952351 3.026065 1.89256
C  -0.566426 2.347787 -0.353582
C  -1.868072 -3.245228 -0.617114
C  0.231361 3.74308 1.887817
C  0.626349 3.060244 -0.38449
C  1.037013 3.760783 0.748336
C  -0.523773 -3.140646 -0.274378
C  -2.201717 -3.452963 -1.953184
C  0.468383 -3.195864 -1.242477
C  -1.217927 -3.545634 -2.926688
C  0.105258 -3.404861 -2.564755
C  3.117675 4.401782 -0.231418
C  4.353799 5.157107 0.190095
C  2.241114 -2.170622 -0.05595
C  3.377465 -2.506028 0.668187
C  1.634566 -0.931597 0.114873
C  3.904157 -1.596842 1.574038
C  2.16263 -0.040305 1.038506
C  3.29546 -0.365031 1.771744
H  -1.611536 -0.605619 -0.099047
H  -1.825688 -0.790273 1.621696
H  -3.946809 -1.388967 -0.512418
H  -4.229371 -1.528215 1.207814
H  -4.246244 2.596016 2.437613
H  -4.826994 0.94022 2.376331
H  -3.354829 1.315274 3.257664
H  -3.476297 1.412148 -1.655065
H  -4.926774 1.076811 -0.719207
H  -4.259782 2.703459 -0.750565
H  -2.534344 -3.291925 1.410925
H  -3.769123 -3.72033 0.239806
H  -1.546837 3.034509 2.799131
H  -0.849555 1.808591 -1.251858
H  0.544678 4.290254 2.769148
H  1.219146 3.051206 -1.289471
H  -0.247548 -2.994064 0.763244
H  -3.241288 -3.544209 -2.243288
H  -1.475556 -3.713189 -3.964824
H  2.692537 4.841019 -1.140109
H  3.366423 3.358017 -0.452285
H  4.807606 4.717535 1.079048
H  5.09098 5.120863 -0.612202
H  4.135486 6.205934 0.39406
H  3.845743 -3.471241 0.520502
H  0.757786 -0.653094 -0.456101
H  4.79162 -1.8617 2.134416
H  1.680236 0.918736 1.178957
H  3.70039 0.336986 2.488695
elementType: Si F O C H
totalener: -1510.07082262 hartree
nucrepener: 2887.93724559 hartree
electener: -4398.00806820 hartree
oneelecener: -7805.70549551 hartree
twoeener: 3407.69742731 hartree
cpcmener: -0.02269186 hartree
kineticenergy: 1503.90477509 hartree
xcener: -135.230004443176 hartree
chargesum: -0.0000000
charge: 0.501611 -0.218035 -0.324978 -0.330687 -0.219222 -0.155526 -0.143092 -0.448310 -0.432798 -0.095535 -0.099008 -0.202712 0.057428 -0.260719 -0.253907 0.331117 -0.257118 -0.216245 0.239905 -0.165925 0.175673 0.067070 -0.272896 0.318459 -0.265832 -0.234885 -0.095238 -0.077473 -0.243458 0.058941 0.089226 0.082682 0.082228 0.109225 0.106181 0.102996 0.106130 0.104831 0.109812 0.085077 0.092923 0.138457 0.137534 0.132853 0.134612 0.147635 0.143045 0.147506 0.092315 0.089308 0.086622 0.088898 0.087682 0.144296 0.173186 0.156764 0.137856 0.153514
qa: 0.5016 -0.2180 -0.3250 -0.3307 -0.2192 -0.1555 -0.1431 -0.4483 -0.4328 -0.0955 -0.0990 -0.2027 0.0574 -0.2607 -0.2539 0.3311 -0.2571 -0.2162 0.2399 -0.1659 0.1757 0.0671 -0.2729 0.3185 -0.2658 -0.2349 -0.0952 -0.0775 -0.2435 0.0589 0.0892 0.0827 0.0822 0.1092 0.1062 0.1030 0.1061 0.1048 0.1098 0.0851 0.0929 0.1385 0.1375 0.1329 0.1346 0.1476 0.1430 0.1475 0.0923 0.0893 0.0866 0.0889 0.0877 0.1443 0.1732 0.1568 0.1379 0.1535
va: 4.1079 1.0678 2.0794 2.0899 3.8093 3.9157 3.7402 3.9257 3.8840 3.8515 3.8622 3.9011 3.5990 4.0187 3.8418 3.7371 3.9185 3.9131 3.6505 3.8790 4.0749 3.7983 3.9748 3.7248 4.0120 3.8879 3.8638 3.7856 3.9916 1.0281 1.0138 1.0012 1.0108 1.0076 1.0104 1.0084 1.0071 1.0058 1.0089 1.0107 1.0075 0.9894 0.9960 1.0145 1.0145 1.0026 1.0014 0.9983 0.9865 0.9871 1.0039 1.0060 1.0032 1.0086 0.9853 0.9883 1.0101 0.9945
dispcorr: -0.031173524 hartree
energy: -1510.101996139683
dipole: -13.75038 13.09997 -0.65041 22.76838 -22.37853 0.38985 13.73287 -13.41098 0.32189
magnitude: 0.82379 au
magnitude: 2.09391 debye
