program: Gaussian 09
title: 000071522
version: EM64L-G09RevD.01
frameworkgroup: C1[X(C21H26NO3)]
method: RPBEPBE
basis: SDD
operation: Freq
keyword: #p
keyword: freq=noraman
keyword: PBEPBE/SDD
title: #p freq=noraman PBEPBE/SDD
converged: YES YES NO NO
title: Mulliken charges:
elementType: O O O N C C C C C C C C C C C C C C C C C C C C C H H H H H H H H H H H H H H H H H H H H H H H H H H
charge: -0.265029 -0.434933 -0.225439 -0.092961 -0.344890 -0.360632 -0.434884 -0.419216 -0.402482 -0.607780 -0.303323 0.196477 -0.105986 0.344096 0.412097 -0.424551 -0.352718 -0.390344 -0.371351 -0.239634 -0.227244 -0.221130 -0.237454 -0.232829 -0.229389 0.283365 0.262857 0.282191 0.276451 0.284175 0.242576 0.283598 0.239654 0.285503 0.311538 0.268226 0.264613 0.308056 0.236619 0.273462 0.363775 0.261927 0.265361 0.288375 0.252469 0.234134 0.236175 0.244910 0.235744 0.245265 0.240510
chargesum: 1.00000
title: Mulliken charges with hydrogens summed into heavy atoms:
elementType: O O O N C C C C C C C C C C C C C C C C C C C C C
charge: -0.265029 -0.071158 -0.225439 -0.092961 0.201332 0.198010 0.091867 0.104036 0.194559 0.233114 0.206757 0.196477 -0.105986 0.344096 0.412097 -0.162624 -0.087356 -0.101969 -0.118883 -0.005500 0.008931 0.023781 -0.001710 0.012437 0.011120
polarizability: 2.47354790e+02 -1.37006130e+01 2.47275824e+02 -5.12170850e+00 -9.07143527e+00 2.00893954e+02
1716.lowfreq: -27.7122 -13.2079 -6.9731 -0.0004 0.0003 0.0004 0.3654 8.0695 15.5750
frequency: -24.8821 4.0385 12.0599 17.6829 39.7155 46.5945 53.5196 69.9967 103.2521 119.0432 143.5783 174.8680 210.5752 225.1141 230.6256 249.6586 271.0130 275.1521 289.4588 300.6709 342.4338 346.7541 356.4655 366.4561 391.4878 397.6305 402.3496 412.5402 432.3031 452.5715 473.7043 503.6714 548.2676 554.7044 596.8817 603.7908 614.7304 615.5535 662.6066 693.9674 695.6066 703.1703 713.2516 727.7473 753.7391 767.6188 799.0096 814.5982 835.9166 856.3101 859.3556 868.5721 891.1218 898.3889 910.9305 919.5817 934.5675 943.5602 948.3461 961.5373 980.7714 983.7495 986.7221 990.8480 991.9045 996.2162 998.5474 1005.2581 1009.6025 1029.0471 1030.5994 1039.2081 1063.8868 1074.5831 1082.5601 1090.8712 1106.8184 1110.6959 1148.3352 1150.9775 1160.2018 1175.8448 1176.3750 1177.4279 1179.3118 1194.0138 1195.4619 1226.9082 1243.9089 1262.5224 1271.0720 1297.2329 1309.2034 1309.2838 1319.6097 1324.1580 1325.9806 1331.6512 1346.1075 1353.5356 1379.2550 1383.1248 1390.0484 1433.7119 1436.4639 1441.3174 1451.4876 1465.0033 1468.0467 1471.5183 1472.8393 1476.2990 1480.7553 1481.0877 1483.3424 1489.8377 1588.6426 1594.3468 1604.4358 1609.2970 1633.5999 3023.1111 3024.5684 3026.6121 3027.0817 3033.6896 3045.4707 3050.0288 3098.6434 3100.3232 3104.0598 3120.5171 3122.2628 3125.2491 3129.2103 3133.4763 3137.9111 3140.0514 3142.7033 3147.0146 3151.6758 3155.8916 3162.3337 3164.5683 3173.8942 3174.2559 3542.1130
redmass: 2.8705 3.8395 3.0774 4.8362 4.0167 4.6418 4.5333 4.5187 4.6416 4.5093 5.8118 3.8004 3.0383 4.7315 4.4575 1.5307 4.5919 5.1208 1.5440 2.4098 4.2242 2.2967 1.7253 2.3130 3.3813 3.1258 2.8272 2.4816 3.1125 2.6596 4.2277 3.7192 1.9819 5.3679 4.2089 4.4528 6.3936 6.4279 5.4084 3.1255 5.4679 1.9636 2.0683 4.2540 1.8504 1.7263 2.2311 2.1912 1.6520 1.3091 2.6819 1.2454 2.0508 4.2413 2.2597 2.5139 1.7029 1.5324 2.2906 1.9135 3.0604 1.4307 2.6425 5.6872 1.9786 2.6780 3.6871 1.4518 1.3478 2.3083 2.1857 3.5837 1.7636 2.1988 1.5678 1.6939 1.6487 2.6740 1.9073 1.8636 1.5749 1.4768 1.5738 1.0550 1.5881 1.1966 1.1299 1.4866 1.2822 1.1893 1.3393 1.1704 1.3624 1.5218 1.3631 1.3469 1.2765 1.2933 1.2823 1.2628 8.1612 9.1410 1.2709 2.1842 2.1979 1.1236 1.0882 1.0767 1.0756 1.0810 1.0824 2.1254 1.0773 2.2026 1.0585 1.0935 6.1161 6.2390 5.9263 6.0976 10.5047 1.0679 1.0386 1.0573 1.0617 1.0589 1.0602 1.0611 1.0998 1.1067 1.1030 1.0869 1.1051 1.1084 1.1086 1.0854 1.0884 1.1054 1.0886 1.0925 1.1057 1.0927 1.0950 1.0956 1.1007 1.1002 1.0651
irintensity: 0.0567 0.0848 1.1449 1.3167 2.0967 1.0451 2.1134 0.2584 4.8746 3.5585 1.2724 1.2758 1.5059 0.8960 1.4733 0.8362 1.4718 0.6666 7.7919 8.6792 22.6464 16.5453 78.5913 0.0607 5.2240 41.5363 0.7379 29.6976 0.5225 5.6884 5.2795 2.7504 2.5774 3.3301 8.3514 18.9494 0.0953 0.6361 32.4613 1.2767 3.0110 43.6542 40.6795 3.1826 131.8305 47.0197 4.5301 11.8977 20.4902 2.2369 31.3132 0.6196 7.3865 4.9841 14.5799 13.7210 25.3931 9.9946 57.2488 1.6633 43.8371 0.2054 11.1389 4.0772 2.7005 27.5895 37.3503 9.0041 0.6967 4.8879 9.4175 4.9876 4.8236 124.5708 3.9737 26.7016 7.6910 119.1776 25.3549 18.5078 1.2103 6.1035 1.1376 0.1235 6.5684 2.4971 1.7370 3.1272 0.4497 4.3828 7.4197 5.0764 1.7464 49.3245 4.1142 25.9681 0.0842 3.4929 2.3218 5.8963 0.0668 0.0253 2.6465 11.3637 22.5366 12.3982 9.0673 6.5542 37.1499 69.7851 20.6728 13.2295 20.4224 18.0180 26.2863 8.8602 0.8240 0.4933 5.5886 3.9386 82.4780 5.1813 4.0807 26.1536 21.2094 3.1614 9.4248 3.7981 0.5777 0.6408 6.6607 4.1573 0.3651 3.7385 13.2554 0.2318 1.4879 9.5400 5.7452 15.2504 1.1559 14.9386 8.6455 16.3283 19.5912 7.7665 13.4880
temp: 298.150 k
press: 1.00000 atm
elementType: 8 8 8 7 6 6 6 6 6 6 6 6 6 6 6 6 6 6 6 6 6 6 6 6 6 1 1 1 1 1 1 1 1 1 1 1 1 1 1 1 1 1 1 1 1 1 1 1 1 1 1
symmnumber: 1
zpe: 1124194.3 jmol-1
zpe.correction: 0.428183 hartree
zpe.thermalcorrener: 0.450963 hartree
zpe.thermalcorrenthalpy: 0.451907 hartree
zpe.thermalcorrgfe: 0.371676 hartree
zpe.sumelectzpe: -1094.148261 hartree
zpe.sumelectthermal: -1094.125481 hartree
zpe.sumelectthermalent: -1094.124537 hartree
zpe.sumelectthermalfe: -1094.204768 hartree
dipole: -17.5767 0.2928 -0.8844
dipole: 17.6014
quadrupole: -49.1911 -123.1634 -133.0984
quadrupole: 6.1895 -0.2229 -2.5440
quadrupole: 52.6266 -21.3458 -31.2808 6.1895 -0.2229 -2.5440
hfenergy: -1094.5764438 hartree
pointgroup: C01 [X(C21H26N1O3)]
dipole: -6.9237348 0.0604286 -0.1132983 debye
polarizability: 246.9091164|-15.6690058|230.2323253|0.4086947|-23.7378444|218.3831265 unknown
InChI: InChI=1S/C21H26NO3/c1-22(14-8-9-15-22)16-17-25-20(23)21(24,18-10-4-2-5-11-18)19-12-6-3-7-13-19/h2-7,10-13,24H,8-9,14-17H2,1H3
charge 1 multiplicity 1
51 atoms
O  -0.644127 0.278284 1.619013
O  1.896085 0.832298 1.933945
O  -0.292306 -1.270849 -0.076296
N  -3.962918 -0.376269 -0.054205
C  -4.854387 -1.050346 1.039858
C  -4.949455 0.515318 -0.890604
C  -6.300211 -0.869633 0.552153
C  -6.266999 0.533875 -0.098136
C  -2.873599 0.51001 0.581839
C  -3.332438 -1.429915 -0.966484
C  -2.040883 -0.196748 1.684098
C  0.169752 -0.370504 0.654129
C  1.589364 0.255636 0.62197
C  1.572538 1.353546 -0.475106
C  2.636051 -0.852669 0.390101
C  0.86957 1.201021 -1.698258
C  3.050988 -1.628861 1.501685
C  2.32542 2.532294 -0.249953
C  3.166972 -1.126807 -0.890759
C  0.909891 2.222319 -2.6750
C  3.989418 -2.66827 1.329412
C  2.362763 3.550327 -1.228158
C  4.105668 -2.169746 -1.060208
C  1.652065 3.402337 -2.441517
C  4.51747 -2.944798 0.046748
H  -4.530815 -2.09475 1.164415
H  -4.689855 -0.501767 1.981461
H  -4.48435 1.500527 -1.047805
H  -5.07725 0.018443 -1.865414
H  -7.012609 -0.937397 1.389672
H  -6.577434 -1.643436 -0.186222
H  -7.126039 0.717448 -0.762825
H  -6.264734 1.324793 0.673331
H  -3.387517 1.397413 0.98754
H  -2.2091 0.834788 -0.236547
H  -2.896932 -0.92377 -1.841868
H  -4.120068 -2.128284 -1.288294
H  -2.526728 -1.958497 -0.437611
H  -2.05345 -1.295989 1.575097
H  -2.371417 0.081161 2.695352
H  1.160105 1.44267 2.201148
H  0.322334 0.274331 -1.909132
H  2.665615 -1.390447 2.497497
H  2.888446 2.63318 0.682741
H  2.870662 -0.524011 -1.754429
H  0.378377 2.089386 -3.624037
H  4.314345 -3.256277 2.194576
H  2.955063 4.453534 -1.046813
H  4.520239 -2.369758 -2.05404
H  1.687579 4.190863 -3.200656
H  5.248741 -3.749403 -0.086005
