program: Orca
programVersion: 5.0.2
elementType: Si F O O C C C C C C C C C C C C C C C C C C C C C C C C C H H H H H H H H H H H H H H H H H H H H H H H H H H H H H
charge: 0
multiplicity: 1
keywords: wb97x-d3
keywords: def2-TZVPP
keywords: def2/J RIJCOSX
keywords: DEFGRID2
keywords: scfconv7
keywords: smallprint printgap noloewdin
keywords: NOSOSCF
formula: C25H29FO2Si
InChI: InChI=1/C25H29FO2Si/c1-4-27-21-13-15-23(16-14-21)29(2,3)18-8-9-20-12-17-24(26)25(19-20)28-22-10-6-5-7-11-22/h5-7,10-17,19H,4,8-9,18H2,1-3H3
58 atoms
Si -3.876845 1.152456 0.243652
F  3.153329 -0.144818 -0.602078
O  0.885437 2.312723 3.787934
O  1.635577 -0.647664 -2.825899
C  -3.304358 0.126767 -1.242787
C  -3.177228 -1.384659 -1.043698
C  -2.436729 1.511894 1.400707
C  -5.239521 0.255247 1.182349
C  -4.520033 2.795619 -0.419318
C  -2.182989 -1.834208 0.024805
C  -2.394755 1.065436 2.718653
C  -1.331218 2.244184 0.948496
C  -0.758285 -1.377195 -0.158928
C  -1.310481 1.313295 3.555371
C  -0.242792 2.503757 1.758358
C  -0.219515 2.030449 3.072651
C  -0.184538 -1.252385 -1.42271
C  0.033849 -1.101203 0.951931
C  1.128881 -0.839788 -1.572423
C  1.353919 -0.693986 0.817989
C  1.886726 -0.556713 -0.444447
C  1.005966 1.796543 5.106629
C  2.360051 2.193699 5.639589
C  2.70077 -1.393709 -3.248236
C  3.07049 -2.596969 -2.662007
C  3.397495 -0.897002 -4.343452
C  4.159002 -3.291795 -3.173716
C  4.477096 -1.60589 -4.84516
C  4.86884 -2.80394 -4.260782
H  -4.026267 0.307421 -2.047395
H  -2.362456 0.547725 -1.611645
H  -2.922791 -1.857016 -1.997782
H  -4.153532 -1.79677 -0.773885
H  -6.080548 0.033396 0.521196
H  -4.905392 -0.69326 1.607494
H  -5.630117 0.861336 2.002755
H  -5.376699 2.651952 -1.081916
H  -4.838333 3.459691 0.38719
H  -3.755442 3.325127 -0.992758
H  -2.525167 -1.508645 1.011041
H  -2.196632 -2.928709 0.06142
H  -3.22388 0.498151 3.126867
H  -1.306185 2.619746 -0.069253
H  -1.336217 0.938164 4.569784
H  0.603079 3.065264 1.379695
H  -0.758319 -1.463907 -2.317182
H  -0.386264 -1.193837 1.94567
H  1.957456 -0.4672 1.68774
H  0.905897 0.705744 5.096654
H  0.211568 2.1963 5.745995
H  2.477744 1.809151 6.652848
H  3.166224 1.781741 5.03152
H  2.474378 3.277489 5.679436
H  2.524093 -3.003873 -1.820321
H  3.094949 0.040353 -4.793732
H  4.447903 -4.227574 -2.712545
H  5.01855 -1.212793 -5.696078
H  5.716045 -3.351889 -4.651319
elementType: Si F O C H
totalener: -1510.06945419 hartree
nucrepener: 2885.48660242 hartree
electener: -4395.55605661 hartree
oneelecener: -7801.70272227 hartree
twoeener: 3406.14666566 hartree
cpcmener: -0.02401530 hartree
kineticenergy: 1503.89897485 hartree
xcener: -135.230651605967 hartree
chargesum: 0.0000000
charge: 0.484024 -0.217900 -0.326793 -0.325694 -0.270303 -0.148989 -0.118046 -0.439510 -0.451816 -0.078687 -0.159662 -0.100327 0.048767 -0.253386 -0.318382 0.365186 -0.244487 -0.200035 0.155351 -0.189048 0.267614 0.059538 -0.273711 0.288739 -0.179195 -0.249609 -0.162318 -0.122654 -0.188897 0.095597 0.084003 0.086994 0.091346 0.113359 0.102653 0.111760 0.101145 0.099808 0.099661 0.078136 0.098574 0.143878 0.131520 0.134915 0.129921 0.132649 0.147056 0.146016 0.092234 0.096719 0.089045 0.087284 0.087283 0.151804 0.143943 0.158626 0.156768 0.157536
qa: 0.4840 -0.2179 -0.3268 -0.3257 -0.2703 -0.1490 -0.1180 -0.4395 -0.4518 -0.0787 -0.1597 -0.1003 0.0488 -0.2534 -0.3184 0.3652 -0.2445 -0.2000 0.1554 -0.1890 0.2676 0.0595 -0.2737 0.2887 -0.1792 -0.2496 -0.1623 -0.1227 -0.1889 0.0956 0.0840 0.0870 0.0913 0.1134 0.1027 0.1118 0.1011 0.0998 0.0997 0.0781 0.0986 0.1439 0.1315 0.1349 0.1299 0.1326 0.1471 0.1460 0.0922 0.0967 0.0890 0.0873 0.0873 0.1518 0.1439 0.1586 0.1568 0.1575
va: 4.1028 1.0686 2.0695 2.0743 3.8427 3.8981 3.6787 3.9138 3.9034 3.8196 3.8599 3.8237 3.6130 3.8647 4.0080 3.6825 3.9561 3.8777 3.7656 3.8788 3.9696 3.7961 3.9764 3.6861 3.8703 3.9942 3.9154 3.8986 3.9040 1.0092 1.0129 1.0001 0.9984 1.0082 1.0067 1.0090 1.0111 1.0102 1.0109 1.0086 1.0031 0.9894 0.9937 1.0133 1.0162 1.0173 0.9954 1.0019 0.9863 0.9867 1.0058 1.0033 1.0034 1.0037 1.0097 0.9909 0.9893 0.9906
dispcorr: -0.031528885 hartree
energy: -1510.100983072348
dipole: -24.78310 23.90997 -0.87312 3.26002 -4.23522 -0.97520 15.06913 -13.84024 1.22889
magnitude: 1.79542 au
magnitude: 4.56360 debye
