program: Orca
programVersion: 5.0.2
elementType: Si F O O C C C C C C C C C C C C C C C C C C C C C C C C C H H H H H H H H H H H H H H H H H H H H H H H H H H H H H
charge: 0
multiplicity: 1
keywords: wb97x-d3
keywords: def2-TZVPP
keywords: def2/J RIJCOSX
keywords: DEFGRID2
keywords: scfconv7
keywords: smallprint printgap noloewdin
keywords: NOSOSCF
formula: C25H29FO2Si
InChI: InChI=1/C25H29FO2Si/c1-4-27-21-13-15-23(16-14-21)29(2,3)18-8-9-20-12-17-24(26)25(19-20)28-22-10-6-5-7-11-22/h5-7,10-17,19H,4,8-9,18H2,1-3H3
58 atoms
Si -2.761219 1.364395 0.351422
F  0.805248 -5.351505 0.7729
O  2.315701 4.550064 1.192534
O  1.667008 -3.298067 -0.729154
C  -2.279135 -0.100828 -0.736565
C  -3.410833 -1.063765 -1.083795
C  -1.201234 2.385154 0.613859
C  -3.40794 0.752843 2.008949
C  -4.07099 2.408795 -0.509354
C  -2.975066 -2.236331 -1.976265
C  -0.467288 2.846932 -0.479096
C  -0.6981 2.692787 1.882273
C  -1.963214 -3.118366 -1.303695
C  0.70772 3.574027 -0.336316
C  0.469894 3.415818 2.051847
C  1.187042 3.861585 0.940273
C  -0.605797 -2.819835 -1.378673
C  -2.362063 -4.207923 -0.533361
C  0.329791 -3.560306 -0.672202
C  -1.433849 -4.975332 0.154459
C  -0.098999 -4.635213 0.091282
C  3.118315 4.985163 0.102852
C  4.340052 5.667412 0.665306
C  2.103684 -2.016836 -0.516308
C  1.480199 -1.151048 0.374714
C  3.242414 -1.621792 -1.205115
C  2.001813 0.121821 0.561472
C  3.759315 -0.350742 -0.99827
C  3.140229 0.529095 -0.120714
H  -1.824073 0.28157 -1.657957
H  -1.4763 -0.629668 -0.21229
H  -4.209566 -0.526443 -1.603549
H  -3.860664 -1.46476 -0.16992
H  -3.650869 1.573631 2.687002
H  -4.322919 0.170862 1.876337
H  -2.687093 0.107403 2.515419
H  -4.328846 3.292993 0.077713
H  -3.728876 2.756442 -1.486837
H  -4.993817 1.846483 -0.669973
H  -3.854948 -2.825759 -2.244918
H  -2.564121 -1.839318 -2.908382
H  -0.805964 2.639445 -1.48888
H  -1.222859 2.360647 2.770953
H  1.23145 3.901647 -1.224368
H  0.838788 3.63725 3.046452
H  -0.270121 -1.988958 -1.988505
H  -3.411902 -4.465819 -0.466904
H  -1.743998 -5.825026 0.749375
H  2.553895 5.676344 -0.532336
H  3.412108 4.131015 -0.517008
H  4.97063 6.01177 -0.154684
H  4.074504 6.536916 1.267546
H  4.932821 4.987673 1.27833
H  0.600086 -1.457303 0.926147
H  3.719723 -2.305389 -1.89619
H  1.512992 0.795818 1.254062
H  4.648043 -0.046697 -1.536405
H  3.542529 1.521863 0.034922
elementType: Si F O C H
totalener: -1510.07107962 hartree
nucrepener: 2893.28327904 hartree
electener: -4403.35435866 hartree
oneelecener: -7816.57220090 hartree
twoeener: 3413.21784224 hartree
cpcmener: -0.02399923 hartree
kineticenergy: 1503.91224106 hartree
xcener: -135.231070068462 hartree
chargesum: -0.0000000
charge: 0.503931 -0.217383 -0.325409 -0.333773 -0.226142 -0.143799 -0.177259 -0.446025 -0.423813 -0.099226 -0.142476 -0.089181 0.066841 -0.277499 -0.278649 0.342487 -0.252587 -0.215004 0.214099 -0.166334 0.183015 0.054098 -0.270562 0.297408 -0.205349 -0.244822 -0.167722 -0.124820 -0.194809 0.088735 0.056514 0.081445 0.080461 0.105682 0.106440 0.108508 0.105713 0.102850 0.101155 0.089966 0.088025 0.129791 0.138316 0.135931 0.129902 0.155238 0.141482 0.148059 0.103915 0.086985 0.089059 0.087876 0.086773 0.159759 0.145231 0.177604 0.155138 0.174211
qa: 0.5039 -0.2174 -0.3254 -0.3338 -0.2261 -0.1438 -0.1773 -0.4460 -0.4238 -0.0992 -0.1425 -0.0892 0.0668 -0.2775 -0.2786 0.3425 -0.2526 -0.2150 0.2141 -0.1663 0.1830 0.0541 -0.2706 0.2974 -0.2053 -0.2448 -0.1677 -0.1248 -0.1948 0.0887 0.0565 0.0814 0.0805 0.1057 0.1064 0.1085 0.1057 0.1028 0.1012 0.0900 0.0880 0.1298 0.1383 0.1359 0.1299 0.1552 0.1415 0.1481 0.1039 0.0870 0.0891 0.0879 0.0868 0.1598 0.1452 0.1776 0.1551 0.1742
va: 4.1083 1.0692 2.0658 2.0829 3.8220 3.9278 3.7648 3.9230 3.8941 3.8591 3.8817 3.8137 3.6002 3.8724 4.0226 3.7029 3.9137 3.9167 3.6726 3.8749 4.0788 3.7957 3.9727 3.6888 3.8994 4.0081 3.8592 3.9216 3.8941 1.0152 1.0306 1.0087 1.0030 1.0085 1.0095 1.0060 1.0094 1.0077 1.0076 1.0083 1.0094 0.9977 0.9900 1.0138 1.0164 0.9987 1.0022 0.9980 0.9898 0.9833 1.0058 1.0037 1.0035 0.9965 1.0074 0.9775 0.9909 0.9734
dispcorr: -0.031939845 hartree
energy: -1510.103019460845
dipole: -12.60717 11.89200 -0.71517 31.81689 -30.60216 1.21474 -2.91607 1.94984 -0.96623
magnitude: 1.70899 au
magnitude: 4.34392 debye
