program: Orca
programVersion: 5.0.2
elementType: Si F O O C C C C C C C C C C C C C C C C C C C C C C C C C H H H H H H H H H H H H H H H H H H H H H H H H H H H H H
charge: 0
multiplicity: 1
keywords: wb97x-d3
keywords: def2-TZVPP
keywords: def2/J RIJCOSX
keywords: DEFGRID2
keywords: scfconv7
keywords: smallprint printgap noloewdin
keywords: NOSOSCF
formula: C25H29FO2Si
InChI: InChI=1/C25H29FO2Si/c1-4-27-21-13-15-23(16-14-21)29(2,3)18-8-9-20-12-17-24(26)25(19-20)28-22-10-6-5-7-11-22/h5-7,10-17,19H,4,8-9,18H2,1-3H3
58 atoms
Si -3.760173 1.721217 0.41164
F  1.783879 -4.760963 -0.570975
O  2.250072 2.339298 0.753989
O  2.16363 -2.159426 -0.124257
C  -4.203672 -0.001034 1.088695
C  -3.111285 -1.064135 0.979167
C  -1.897438 1.961231 0.532581
C  -4.636521 3.016232 1.461592
C  -4.307691 1.91488 -1.379706
C  -2.680432 -1.356298 -0.45825
C  -1.240388 1.806715 1.753495
C  -1.096693 2.244664 -0.578278
C  -1.495998 -2.277764 -0.514941
C  0.13777 1.921689 1.880139
C  0.278005 2.369786 -0.478051
C  0.910708 2.209353 0.755929
C  -0.214114 -1.765965 -0.323846
C  -1.64837 -3.647137 -0.706942
C  0.893518 -2.598862 -0.351071
C  -0.549032 -4.493826 -0.718343
C  0.710233 -3.959774 -0.551969
C  2.982527 2.23826 1.968412
C  2.90473 3.49409 2.810571
C  2.700831 -1.140048 -0.857972
C  2.196502 -0.717483 -2.081515
C  3.841605 -0.550838 -0.324627
C  2.835593 0.314956 -2.756291
C  4.47336 0.46965 -1.016833
C  3.969904 0.91616 -2.231698
H  -4.482842 0.112101 2.14171
H  -5.114316 -0.344865 0.584505
H  -3.448407 -1.997685 1.441108
H  -2.235264 -0.74713 1.551384
H  -4.294326 2.994122 2.498812
H  -4.463315 4.025757 1.082627
H  -5.717065 2.853446 1.474219
H  -4.096414 2.915537 -1.763112
H  -3.831487 1.196983 -2.05024
H  -5.38662 1.762942 -1.463279
H  -3.518385 -1.787749 -1.01191
H  -2.422171 -0.423083 -0.965492
H  -1.807921 1.584694 2.651535
H  -1.547813 2.370295 -1.556179
H  0.582722 1.786328 2.856596
H  0.874082 2.590206 -1.355784
H  -0.077647 -0.702121 -0.156243
H  -2.637514 -4.064316 -0.849927
H  -0.667105 -5.559664 -0.86675
H  4.013734 2.067801 1.658465
H  2.674705 1.355003 2.536472
H  1.896151 3.70698 3.165106
H  3.543606 3.378047 3.687174
H  3.260117 4.361421 2.252916
H  1.319562 -1.176579 -2.518558
H  4.230085 -0.893973 0.626346
H  2.436313 0.644804 -3.706907
H  5.361588 0.923894 -0.596762
H  4.459462 1.719648 -2.76581
elementType: Si F O C H
totalener: -1510.06753759 hartree
nucrepener: 2974.35829439 hartree
electener: -4484.42583198 hartree
oneelecener: -7979.31738253 hartree
twoeener: 3494.89155055 hartree
cpcmener: -0.02409118 hartree
kineticenergy: 1503.91364657 hartree
xcener: -135.234743093570 hartree
chargesum: 0.0000000
charge: 0.481013 -0.216607 -0.330829 -0.326433 -0.290962 -0.135878 -0.127786 -0.447488 -0.429968 -0.067046 -0.222116 -0.089313 0.008707 -0.201142 -0.292901 0.341169 -0.170031 -0.181977 0.195311 -0.180556 0.194993 0.039437 -0.260532 0.329314 -0.193401 -0.251957 -0.183886 -0.138489 -0.167944 0.099096 0.087110 0.094661 0.084518 0.099679 0.099616 0.100903 0.106672 0.105421 0.108535 0.097772 0.077038 0.138766 0.142100 0.138761 0.134563 0.085501 0.140121 0.146684 0.101698 0.092580 0.091813 0.093974 0.088906 0.152245 0.140747 0.157105 0.155558 0.155158
qa: 0.4810 -0.2166 -0.3308 -0.3264 -0.2910 -0.1359 -0.1278 -0.4475 -0.4300 -0.0670 -0.2221 -0.0893 0.0087 -0.2011 -0.2929 0.3412 -0.1700 -0.1820 0.1953 -0.1806 0.1950 0.0394 -0.2605 0.3293 -0.1934 -0.2520 -0.1839 -0.1385 -0.1679 0.0991 0.0871 0.0947 0.0845 0.0997 0.0996 0.1009 0.1067 0.1054 0.1085 0.0978 0.0770 0.1388 0.1421 0.1388 0.1346 0.0855 0.1401 0.1467 0.1017 0.0926 0.0918 0.0940 0.0889 0.1522 0.1407 0.1571 0.1556 0.1552
va: 4.0896 1.0709 2.0567 2.0892 3.8578 3.8542 3.7060 3.8978 3.8995 3.7319 3.9360 3.8064 3.6677 3.8797 3.9708 3.6961 3.9078 3.8920 3.6845 3.8865 4.0520 3.8425 3.9448 3.6378 3.8403 3.9206 3.8894 3.8497 3.8806 1.0083 1.0127 1.0102 1.0079 1.0116 1.0117 1.0099 1.0075 1.0086 1.0114 1.0120 1.0232 0.9915 0.9898 1.0055 1.0114 1.0399 1.0034 0.9992 0.9898 0.9923 1.0024 1.0077 1.0050 0.9991 1.0112 0.9915 0.9901 0.9904
dispcorr: -0.034257528 hartree
energy: -1510.101795120702
dipole: -21.08174 20.20272 -0.87901 27.36168 -26.60899 0.75269 8.93776 -8.42412 0.51364
magnitude: 1.26611 au
magnitude: 3.21820 debye
