program: Orca
programVersion: 5.0.2
elementType: Si F O O C C C C C C C C C C C C C C C C C C C C C C C C C H H H H H H H H H H H H H H H H H H H H H H H H H H H H H
charge: 0
multiplicity: 1
keywords: wb97x-d3
keywords: def2-TZVPP
keywords: def2/J RIJCOSX
keywords: DEFGRID2
keywords: scfconv7
keywords: smallprint printgap noloewdin
keywords: NOSOSCF
formula: C25H29FO2Si
InChI: InChI=1/C25H29FO2Si/c1-4-27-21-13-15-23(16-14-21)29(2,3)18-8-9-20-12-17-24(26)25(19-20)28-22-10-6-5-7-11-22/h5-7,10-17,19H,4,8-9,18H2,1-3H3
58 atoms
Si -3.681792 1.766457 0.184315
F  1.864565 -4.705518 -0.198146
O  2.296567 2.295307 0.976689
O  2.173627 -2.048672 -0.052765
C  -4.227134 0.106566 0.94206
C  -3.161372 -0.988981 0.980644
C  -1.826548 1.969314 0.43226
C  -4.585955 3.154617 1.082265
C  -4.091507 1.861649 -1.651417
C  -2.684651 -1.416443 -0.407186
C  -0.927417 2.125999 -0.627289
C  -1.277977 1.919098 1.714273
C  -1.483067 -2.315187 -0.351775
C  0.43774 2.232581 -0.420953
C  0.087144 2.019401 1.948291
C  0.959412 2.183929 0.873103
C  -0.213449 -1.755661 -0.235109
C  -1.601446 -3.701359 -0.383073
C  0.91545 -2.557674 -0.186591
C  -0.479582 -4.515841 -0.316312
C  0.768382 -3.93574 -0.233994
C  2.928897 2.208184 2.247432
C  2.867328 3.504198 3.027398
C  2.634678 -1.129966 -0.954779
C  2.112075 -0.987661 -2.234659
C  3.702244 -0.34494 -0.537486
C  2.656238 -0.035649 -3.086062
C  4.238275 0.596539 -1.402376
C  3.715391 0.762686 -2.678166
H  -4.572418 0.303142 1.96267
H  -5.11248 -0.248278 0.401852
H  -3.542359 -1.868561 1.509333
H  -2.301518 -0.641201 1.559254
H  -4.341001 4.131618 0.659914
H  -5.670024 3.033757 1.016859
H  -4.327556 3.18403 2.143233
H  -5.165223 1.73116 -1.80692
H  -3.823936 2.832483 -2.074605
H  -3.588285 1.094795 -2.243318
H  -3.501394 -1.913116 -0.937321
H  -2.428487 -0.532358 -0.996704
H  -1.29046 2.162521 -1.648283
H  -1.924559 1.794947 2.57714
H  1.111765 2.352539 -1.261429
H  0.444629 1.971965 2.967972
H  -0.100024 -0.676865 -0.196123
H  -2.580167 -4.157362 -0.46724
H  -0.571227 -5.594128 -0.34597
H  3.968114 1.962288 2.026557
H  2.522474 1.373347 2.826302
H  1.849689 3.793793 3.289723
H  3.427107 3.390217 3.956816
H  3.31985 4.321632 2.464909
H  1.291778 -1.603902 -2.578738
H  4.105741 -0.470966 0.459693
H  2.244097 0.074715 -4.080921
H  5.066556 1.209144 -1.070092
H  4.131442 1.503534 -3.348086
elementType: Si F O C H
totalener: -1510.06733451 hartree
nucrepener: 2974.18196065 hartree
electener: -4484.24929516 hartree
oneelecener: -7978.96517663 hartree
twoeener: 3494.71588148 hartree
cpcmener: -0.02375730 hartree
kineticenergy: 1503.90881194 hartree
xcener: -135.233015433722 hartree
chargesum: 0.0000000
charge: 0.474622 -0.216957 -0.329010 -0.330876 -0.287418 -0.131815 -0.122157 -0.448865 -0.430263 -0.073543 -0.089567 -0.218380 -0.005421 -0.288719 -0.211685 0.348884 -0.140414 -0.172390 0.169519 -0.189598 0.212757 0.039288 -0.256944 0.317568 -0.188882 -0.270092 -0.160700 -0.113128 -0.191220 0.099501 0.085766 0.094180 0.082858 0.099536 0.100681 0.099848 0.108824 0.106896 0.104616 0.096832 0.075967 0.139803 0.138397 0.134476 0.138004 0.083870 0.140356 0.146663 0.101179 0.092070 0.090135 0.093076 0.088549 0.150348 0.144206 0.157869 0.155341 0.155557
qa: 0.4746 -0.2170 -0.3290 -0.3309 -0.2874 -0.1318 -0.1222 -0.4489 -0.4303 -0.0735 -0.0896 -0.2184 -0.0054 -0.2887 -0.2117 0.3489 -0.1404 -0.1724 0.1695 -0.1896 0.2128 0.0393 -0.2569 0.3176 -0.1889 -0.2701 -0.1607 -0.1131 -0.1912 0.0995 0.0858 0.0942 0.0829 0.0995 0.1007 0.0998 0.1088 0.1069 0.1046 0.0968 0.0760 0.1398 0.1384 0.1345 0.1380 0.0839 0.1404 0.1467 0.1012 0.0921 0.0901 0.0931 0.0885 0.1503 0.1442 0.1579 0.1553 0.1556
va: 4.0892 1.0705 2.0722 2.0801 3.8579 3.8558 3.7086 3.8990 3.8986 3.7392 3.7939 3.9309 3.6867 3.9686 3.8874 3.7139 3.8795 3.8833 3.6985 3.8953 4.0383 3.8478 3.9368 3.6467 3.8602 3.9436 3.8903 3.8561 3.8865 1.0079 1.0131 1.0099 1.0090 1.0116 1.0102 1.0117 1.0115 1.0074 1.0090 1.0121 1.0219 0.9915 0.9921 1.0104 1.0065 1.0384 1.0028 0.9993 0.9908 0.9952 1.0023 1.0083 1.0051 1.0006 1.0079 0.9909 0.9898 0.9912
dispcorr: -0.034058716 hartree
energy: -1510.101393225923
dipole: -21.46224 20.47897 -0.98328 27.23640 -26.54044 0.69597 6.95424 -6.50609 0.44815
magnitude: 1.28532 au
magnitude: 3.26702 debye
